{"text_format":"1","workbook":"xlsx","n_sheets":17,"sheets":["Leiðbeiningar","Forsíða","Innsláttur","Innsláttur - Vegir","Innsláttur - Brýr","Innsláttur - Jarðgöng","Innsláttur - Gönguleiðir","Niðurstöður - Vegir","Niðurstöður - Brýr","Niðurstöður - Jarðgöng","Niðurstöður - Gönguleiðir","Niðurstöður - Heildarframkvæmd","Reiknistuðlar","Reiknistuðlar - endurnýjun","Losunarstuðlar","Útgáfusaga","Sheet2"],"not_rendered":{"charts":20,"images":10,"macros":1,"external_links":0,"defined_names":212,"comments":2,"pivot_tables":0},"unopened":[],"bounds":{"document_bytes":16777216,"sheet_cells":100000,"rows_first":2000,"rows_last":500,"rows_between":2000,"halvings":0,"cell_chars":16384,"cell_head_chars":4096},"cells_cut":0,"cells_raw":0,"read":"whole","date_system":"1900"}

{"sheet":"Leiðbeiningar","index":0,"n_rows":29,"n_cols":2,"rows_kept":29,"cut":false,"hidden":false,"merged":[]}
[]
[]
[]
[]
[]
[]
[]
[null,"Leiðbeiningar fyrir LOK - kolefnisreikni fyrir innviði, útgáfu 1.01"]
[null,"Kolefnisreiknirinn er unninn af EFLU Verkfræðistofu fyrir Vegagerðina. Útgáfa dagsett 16. september 2024"]
[]
[]
[null,"Velkomin í kolefnisreikni fyrir innviði. Hér er hægt að reikna kolefnisspor af byggingu ýmissa innviða, m.a. vega, brúa, jarðgangna og göngu/hjólastíga"]
[]
[null,"Kolefnisspor mannvirkis má skilgreina sem heildarlosun gróðurhúsalofttegunda sem rekja má til framkvæmdarinnar, allt frá framleiðslu og öflun hráefna að förgun mannvirkisins að líftíma þess loknum. Vistferli mannvirkja er skipt í vistferilsfasa:\n     A1-A3: Framleiðsla og öflun hráefna.\n     A4: Flutningur hráefna á verkstað\n     A5: Losun á verkstað\n     B1-B7: Notkunartími, þ.á m. viðhald, viðgerðir og útskipti.\n     C1-C4: Lok líftíma, þ.á m. niðurrif, úrgangsmeðhöndlun og förgun\n\nÍ þessari útgáfu kolefnisreiknis fyrir innviði er þó ekki horft til alls vistferilsins heldur aðeins vistferilsfasa A1-A3, A4, A5 og B4 (útskipti).\n\nEining kolefnisspors er kílógrömm CO2-ígilda (kg CO2-íg.). "]
[null,"Þessu skjali er skipt í flipa sem flokka má í fjóra flokka: \n     1. Forsíðan, þar sem slegnar eru inn helstu upplýsingar um verkefnið, svosem nafn, staðsetning, dagsetning og framkvæmdarstig.\n     2. Innsláttarflipar, þar sem slegnar eru inn magntölur verkefnisins. Innsláttarfliparnir eru fjórir, þ.e. sérflipi fyrir hverja tegund innviða: vegir, brýr, jarðgöng og gönguleiðir.\n     3. Niðurstöðuflipar, þar sem teknar eru saman niðurstöður fyrir hverja tegund innviða fyrir sig.\n     4. Reikni- og losunarstuðlar, en þar má finna þær forsendur sem notaðar eru við útreikningana, t.a.m. rúmþyngdir efna, áætlaða olíunotkun ýmissa vinnuvéla og losunarstuðla byggingarefna.\n\nHér fyrir neðan er notkun flipanna lýst nánar"]
[]
[null,"Forsíða\nVinstra megin í þessum flipa er notandinn beðinn um að slá inn upplýsingar um verkefnið, þ.e. Nafn verkefnis, Staðsetning, Dagsetning greiningar, Greiningartíminn, Nafn þess sem gerði útreikningana, áætlaða árdagsumferð og Framkvæmdarstig.\n\nHægra megin í flipanum er beðið um nánari útlistun á hverjum vegkafla. Beðið er um gerð vegainnviða (vegur, brú, jarðgöng eða gönguleið valið úr lista), lýsingu, lengd og breidd. Framkvæmdin getur staðið saman af nokkrum vegköflum af mismunandi gerð og með þessu móti má áætla kolefnissporið fyrir hverja tegund vegkafla."]
[]
[null,"Innsláttur\nInnsláttarfliparnir eru fjórir, þ.e. sérflipi fyrir vegi, brýr, jarðgöng og gönguleiðir. Virkni þeirra allra er eins. Flipunum er skipt niður í kafla og verkþætti í samræmi við verkþáttaskrá Vegagerðarinnar. Ekki eru allir verkþættir innifaldir í útreikningunum heldur aðeins þeir sem talið er að hafi mesta vægi þegar kemur að kolefnisspori innviðaframkvæmda. \n\nNotandinn er beðinn um að slá inn annars vegar magnupplýsingar í dálk F, og hins vegar flutningsvegalengdir í dálka N og O. Þegar nýtt eintak af kolefnisreikninum er opnað eru sjálfgefin gildi flutningsvegalengda nú þegar slegin inn (2800 km fyrir sjóflutninga og 20 km fyrir landflutninga), en gert er ráð fyrir að notandinn breyti þeim, ef hann hefur nákvæmari upplýsingar um uppruna þeirra efna sem notuð eru. Í einstökum línum er beðið um frekari upplýsingar, sem þá eru settar inn í dálk D, oftast er þá valið úr lista fyrirfram ákveðinna möguleika. Allir reitir sem gert er ráð fyrir að notandinn meðhöndli eru gulir. Athugið at sum efni eins og steypa og malbik eru með sjálfgefna sjóflutningsvegalengd sem 0 km, þó sement, bik og önnur íblöndunarefni séu flutt inn til Íslands. Hér er þó miðað við að steypu- eða malbiksblandan sjálf sé framleidd á Íslandi og því aðeins miðað við flutning á landi. Flutningur hráefnanna til landsins er innifalinn í vistferilsfasa A1-A3 fyrir þessi efni.\n\nEiningin í dálki G er sú eining sem beðið er um að magnið sé gefið upp í og er í flestum tilfellum í samræmi við einingar sem tilteknar eru í verkþáttaskrá Vegagerðarinnar. Dálkar P, Q og R innihalda upplýsingar sem notaðar eru í útreikningana, en þar eru magnupplýsingarnar sem notandinn slær inn m.a. færðar í einingu sem hentar betur fyrir útreikninga kolefnisspors. Í dálki S má svo sjá áætlaða olíunotkun sem fylgir þeim liðum sem krefjast olíu, t.d. jarðvinnuliðir og útlögn malbiks.\n\nÍ dálkum W, X, Y, Z, AA og AB, sem saman eru nefndir Losun koma svo fram niðurstöður útreikninganna fyrir hvern vistferilsfasa, en niðurstöður eru einnig teknar saman í áðurnefndum niðurstöðuflipum.\n\nBergskeringar\nMagn í bergskeringar er óhreyft berg. Þarna er slegið inn allt berg sem er losað í verkinu, hvort sem berg er losað til notkunar í fyllingar, styrktarlög, burðarlög eða slitlög. Þarna getur því verið um að ræða meira magn en notað er í fyllingar eingöngu. Í bergskeringaliðum er einungis áætluð kolefnislosun af losun bergsins. Flutningur, vinnsla og notkun efnisins er áætluð í viðkomandi liðum (fyllingar, burðarlög, o.s.frv.)"]
[null,"\nDæmi um notkun:\nSkoðum verkþátt 63.42 Burðarlagsmalbik.\n\n\n\n\n\n\nÞar er notandinn beðinn um bæði þykkt og magn í fermetrum, en auk þess þarf að skoða flutningsvegalengdir. Þó að hráefni í malbik séu flutt til Íslands erlendis frá er malbikið sjálft framleitt á Íslandi, og því er sjálfgefin flutningsvegalengd á sjó 0 km. En ef vitað er að malbikið verði flutt frá Reykjavík til Selfoss, sem er um 60 km vegalengd breytir notandinn tölunni í dálki O (flutningsvegalengd innanlands) úr 20 km í 60 km. Eftir innslátt gæti línan því litið svona út:"]
[null,"Nú sést að áætluð þyngd 1235 fermetra af 50 mm þykku malbiki er um 160.550 kg og að áætluð olíunotkun við útlögn þess sé 128,44 lítrar. Þessar tölur eru í raun aðeins til upplýsinga, og ekki gert ráð fyrir að notandinn meðhöndli þær. "]
[null,"Í dálkum W-AB má nú sjá áætlaða losun gróðurhúsalofttegunda (kolefnisspor) vegna notkunar burðarlagsmalbiks í framkvæmdinni. Framleiðsla og öflun hráefna (A1-A3) losar um 2.007 kg CO2-ígilda, flutningur á verkstað (A5) losar um 1.580 kg CO2-ígilda og að við útlögnina (A5) losni 416 kg CO2-ígilda. Samtals er losun vegna A1-A5 því 4.003 kg CO2-ígilda. Gert er ráð fyrir að á líftímanum sé burðarlagsmalbikinu einu sinni skipt alveg út og er því losun í vistferilsfasa B4 önnur 4.003 kg CO2-ígilda. Heildarlosun yfir líftímann er því áætluð 8.006 kg CO2-ígilda."]
[null,"Niðurstöður\nNiðurstöðufliparnir eru fimm talsins, einn fyrir hverja tegund innviðaframkvæmdar (vegir, brýr, jarðgöng og gönguleiðir) auk niðurstöðuflipa fyrir heildarframkvæmdina. Niðurstöðunum er skipt í tvennt. Vinstra megin eru þrjár töflur með niðurstöðum á tölulegu formi. Í þeirri fyrstu er niðurstöðum deilt niður á yfirverkþætti, í þeirri næstu er þeim skipt niður á efnisflokka, og í þeirri þriðju er þeim deilt niður á undirverkþætti. Hægra megin er svo nokkurs konar niðurstöðuskýrsla þar sem má finna, auk tölulegra niðurstaðna, helstu upplýsingar um verkefnið sem slegnar voru inn í forsíðuflipann, auk súlu- og skífurita sem brjóta niðurstöðurnar niður á margvíslegan hátt.\n\nUm óvissu\nTil að auka gagnsæi er áætluð óvissa, mismikil eftir því á hvaða stigi framkvæmdar verkefnið er statt:\n     Frumdrög: óvissa frá -20% til +40%\n     Forhönnun: óvissa frá -15% til +25%\n     Verkhönnun: óvissa frá -10% til +15%\n     Framkvæmd: óvissa frá -5% til +10%\n     Framkvæmdum lokið: engin áætluð óvissa\n\nÍ niðurstöðutöflunum er óvissan ekki sýnd, heldur aðeins útreiknað gildi út frá þeim upplýsingum sem notandinn slær inn og öðrum forsendum. Í hverjum niðurstöðuflipa kemur þó fram áætluð óvissa fyrir heildarframkvæmdina og óvissubil gefið upp."]
[null,"Reikni- og losunarstuðlar\nÍ flipanum Reiknistuðlar má sjá yfirlit yfir þá reiknistuðla sem notaðir eru við útreikningana. Til dæmis rúmþyngdir ýmissa efna, þyngdir á lengdarmetra, þykktir, áætlaða olíunotkun vinnuvéla og fleira. Notandinn hefur þann möguleika að yfirskrifa gildin sem eru sjálfgefin, ef hann hefur sértækar upplýsingar fyrir verkefnið.\n\nDæmi um notkun:\nSkoðum sem dæmi massa bitavegriðs á lengdarmetra."]
[null,"Undir dálkinum Eining má sjá hvaða eining er notuð, í þessu tilfelli kílögrömm á metra. Undir Notað gildi er gildið sem er notað í útreikningana, sem annað hvort er Sjálfgefið gildi eða Yfirskrifað gildi. Sjálfgefna gildið er gildið sem hefur verið áætlað við gerð kolefnisreiknisins að eigi við um hefðbundin bitavegrið á Íslandi. Sé notandinn með sértækar upplýsingar um þyngd bitavegriða í tilteknu verkefni getur hann fært það inn í dálkinn Yfirskrifað gildi. Þegar slegið er inn í reitinn fyri yfirskrifuð gildi uppfærist notaða gildið og uppfærast þá allir útreikningar sömuleiðis."]
[null,"Flipinn Reiknistuðlar - endurnýjun inniheldur forsendur sem reiknað er með um endingartíma byggingarefna. Þar er gefinn upp sá endingartími sem reiknað er með í árum talið en á sama hátt og fyrir reiknistuðlana sem lýst var fyrir ofan getur notandinn yfirskrifað gildin."]
[null,"Flipinn Losunarstuðlar er sömuleiðis sambærilegur. Þar eru listaðir upp þeir losunarstuðlar sem notaðir eru við útreikningana en losunarstuðull er tala sem segir til um hversu mikið magn gróðurhúsalofttegunda losnar við ákveðið ferli, til dæmis framleiðsluferli ákveðins byggarefnis eða bruna olíu. Losunarstuðlar eru gefnir upp í kg CO2-ígildi á einhverja ákveðna einingu. Fyrir framleiðslu á steypu getur losunarstuðull til dæmis verið 330 kg CO2-ígildi/m3 og fyrir bruna á dísilolíu getur losunarstuðullinn verið 3,24 kg CO2-ígildi/L. Við gerð kolefnisreiknisins voru áætlaðir losunarstuðlar fyrir framleiðslu á öllum byggingarefnum sem tiltekin eru í reikninum, auk annarra ferla. Sé notandinn með sértækar upplýsingar um losunarstuðla í tilteknu verkefni, til dæmis úr EPD (Environmental Product Declaration) blöðum, getur hann yfirskrifað sjálfgefin gildi, rétt eins og með reiknistuðlana. Passa þarf að viðmiðunareiningin sé sú sama.\n\nDæmi um notkun\nSkoðum sem dæmi losunarstuðul fyrir framleiðslu á C30/37 steypu. Með framleiðslu er átt við vistferilsfasa A1-A3"]
[null,"Þarna sjáum við að viðmiðunareiningin er rúmmetrar (m3) og að sjálfgefinn losunarstuðull er 358 kg CO2-íg./m3. Ef notandinn veit að framleiðandi steypublöndunnar sem notuð er hefur látið gera EPD blað fyrir þá tilteknu blöndu getur hann fært upplýsingar úr EPD blaðinu yfir í dálkinn Yfirskrifað gildi. Sem dæmi hefur BM Vallá látið gera EPD blað fyrir C30/37 steypublöndu. Þar koma fram eftirfarandi upplýsingar:"]
[null,"Ef tölurnar í dálkum A1-A3 eru lagðar saman fyrir GWP (Global Warming Potential) er summan 309 kg CO2-íg./m3, sem er þá talan sem notandinn færir inn í dálkinn Yfirskrifað gildi og uppfærist þá Notað gildi sjálfkrafa"]

{"sheet":"Forsíða","index":1,"n_rows":20,"n_cols":13,"rows_kept":20,"cut":false,"hidden":false,"merged":[[19,8,19,12],[2,2,2,3],[10,3,10,6],[11,3,11,6],[4,3,4,6],[5,3,5,6],[6,3,6,6],[7,3,7,6],[8,3,8,6]]}
[]
[]
[null,null,"Upplýsingar um verkefnið"]
[]
[null,null,"Nafn verkefnis",null,null,null,null,null,"Gerð vegainnviða","Lýsing","Lengd [m]","Breidd* [m]","Flatarmál [m2]"]
[null,null,"Staðsetning",null,null,null,null,null,"Vegur",null,0,5,{"$f":"K6*L6","v":0}]
[null,null,"Dagsetning greiningar","dd.mm.yyyy",null,null,null,null,"Brú",null,0,5,{"$f":"K7*L7","v":0}]
[null,null,"Greiningartími (ár)",60,null,null,null,null,"Vegur",null,0,5,0]
[null,null,"Unnið af",null,null,null,null,null,"Veldu tegund vegkafla",null,null,null,0]
[null,null,null,null,null,null,null,null,"Veldu tegund vegkafla",null,null,null,0]
[null,null,"Árdagsumferð (ÁDU)",null,null,null,null,null,"Veldu tegund vegkafla",null,null,null,0]
[null,null,"Framkvæmdarstig","Veldu framkvæmdarstig",null,null,null,null,"Veldu tegund vegkafla",null,null,null,0]
[null,null,null,null,null,null,null,null,"Veldu tegund vegkafla",null,null,null,0]
[null,null,"Heildarlengd vegs [m]",{"$f":"SUMIF(I6:I19,Sheet2!M3,K6:K19)","v":0},null,"Heildarflatarmál vegs [m2]",{"$f":"SUMIF(I6:I19,Sheet2!M3,M6:M19)","v":0},null,"Veldu tegund vegkafla",null,null,null,0]
[null,null,"Heildarlengd brúa [m]",{"$f":"SUMIF(I6:I19,Sheet2!M4,K6:K19)","v":0},null,"Heildarflatarmál brúa [m2]",{"$f":"SUMIF(I6:I19,Sheet2!M4,M6:M19)","v":0},null,"Veldu tegund vegkafla",null,null,null,0]
[null,null,"Heildarlengd jarðgangna [m]",{"$f":"SUMIF(I6:I19,Sheet2!M5,K6:K19)","v":0},null,"Heildarflatarmál jarðgangna [m2]",{"$f":"SUMIF(I6:I19,Sheet2!M5,M6:M19)","v":0},null,"Veldu tegund vegkafla",null,null,null,0]
[null,null,"Heildarlengd gönguleiða [m]",{"$f":"SUMIF(I6:I19,Sheet2!M6,K6:K19)","v":0},null,"Heildarflatarmál jarðgangna [m2]",{"$f":"SUMIF(I7:I20,Sheet2!M6,M7:M20)","v":0},null,"Veldu tegund vegkafla",null,null,null,0]
[null,null,null,null,null,null,null,null,"Veldu tegund vegkafla",null,null,null,0]
[null,null,"Heildarlengd framkvæmdar [m]",{"$f":"SUM(D14:D16)","v":0},null,"Heildarflatarmál framkvæmdar [m2]",{"$f":"SUM(G14:G16)","v":0},null,"Veldu tegund vegkafla",null,null,null,0]
[null,null,null,null,null,null,null,null,"* Fyrir vegi og gönguleiðir er miðað við breidd slitlags. Fyrir brýr er miðað við fría breidd milli vegriða. Í jarðgöngum er miðað við breidd slitlags á vegi."]

{"sheet":"Innsláttur","index":2,"n_rows":174,"n_cols":28,"rows_kept":174,"cut":false,"hidden":true,"merged":[[5,0,5,1],[5,2,5,4],[6,2,6,4],[7,2,7,4],[8,0,8,1],[8,2,8,4],[0,19,0,21],[0,22,0,27],[2,0,2,26],[3,0,3,1],[3,2,3,4],[4,0,4,1],[4,2,4,4],[0,10,1,10],[0,11,1,11],[0,12,1,12],[0,13,1,13],[0,14,1,14],[0,15,1,15],[0,0,1,1],[0,2,1,4],[0,5,1,5],[0,6,1,6],[0,8,1,8],[13,16,13,17],[13,19,13,21],[14,0,14,26],[15,0,15,1],[15,2,15,4],[16,2,16,4],[9,2,9,4],[10,2,10,4],[11,0,11,1],[11,2,11,4],[12,0,12,1],[12,2,12,4],[0,9,1,9],[23,2,23,4],[24,2,24,4],[25,2,25,4],[26,2,26,4],[27,2,27,4],[28,2,28,4],[17,2,17,4],[18,2,18,4],[19,2,19,4],[20,2,20,4],[21,2,21,4],[22,2,22,4],[35,2,35,4],[36,2,36,4],[37,2,37,4],[38,2,38,4],[39,2,39,4],[40,2,40,4],[29,2,29,4],[30,2,30,4],[31,2,31,4],[32,2,32,4],[33,2,33,4],[34,2,34,4],[47,2,47,4],[48,2,48,4],[49,2,49,4],[50,2,50,4],[51,2,51,4],[52,2,52,4],[41,2,41,4],[42,2,42,4],[43,2,43,4],[44,2,44,4],[45,2,45,4],[46,2,46,4],[57,6,59,6],[57,12,59,12],[60,2,62,4],[60,5,62,5],[60,6,62,6],[60,12,62,12],[53,2,53,4],[54,2,54,4],[55,2,55,4],[56,2,56,4],[57,2,59,4],[57,5,59,5],[69,2,69,4],[70,2,70,4],[71,2,71,4],[72,2,72,4],[76,16,76,17],[76,19,76,21],[63,2,65,4],[63,5,65,5],[63,6,65,6],[63,12,65,12],[66,2,68,4],[66,5,68,5],[66,6,68,6],[66,12,68,12],[84,16,84,17],[84,19,84,21],[87,0,87,26],[88,0,88,1],[88,2,88,4],[77,0,77,26],[78,2,78,4],[79,2,79,4],[80,2,80,4],[81,2,81,4],[82,2,82,4],[89,0,89,1],[90,0,90,1],[90,2,90,4],[94,0,94,1],[94,2,94,4],[95,0,95,1],[95,2,95,4],[83,2,83,4],[84,2,84,4],[102,0,102,1],[102,2,102,4],[103,0,103,1],[103,2,103,4],[104,2,105,4],[104,5,105,5],[98,16,98,17],[98,19,98,21],[99,0,99,26],[100,0,100,1],[100,2,100,4],[101,0,101,1],[101,2,101,4],[108,12,109,12],[110,0,110,1],[110,2,110,4],[104,6,105,6],[104,12,105,12],[106,2,107,4],[106,5,107,5],[106,6,107,6],[106,12,107,12],[111,0,111,1],[111,2,111,4],[112,0,112,1],[112,2,112,4],[113,0,113,1],[113,2,113,4],[108,2,109,4],[108,5,109,5],[108,6,109,6],[117,5,118,5],[117,6,118,6],[119,2,120,2],[119,3,120,3],[119,4,120,4],[119,5,120,5],[119,6,120,6],[114,0,114,1],[114,2,114,4],[115,0,115,1],[116,0,116,1],[116,2,116,4],[117,2,118,2],[117,3,118,3],[117,4,118,4],[121,2,122,2],[121,3,122,3],[121,4,122,4],[121,5,122,5],[121,6,122,6],[123,2,124,2],[123,3,124,3],[123,4,124,4],[123,5,124,5],[123,6,124,6],[128,2,128,4],[129,16,129,17],[129,19,129,21],[130,0,130,26],[131,0,131,1],[131,2,131,4],[125,2,126,2],[125,3,126,3],[125,4,126,4],[125,5,126,5],[125,6,126,6],[127,0,127,1],[127,2,127,4],[136,0,136,1],[136,2,136,4],[137,2,137,4],[138,0,138,1],[138,2,138,4],[139,0,139,1],[139,2,139,4],[132,0,132,1],[132,2,132,4],[133,2,133,4],[134,0,134,1],[134,2,134,4],[135,0,135,1],[135,2,135,4],[144,0,144,1],[144,2,144,4],[145,0,145,1],[145,2,145,4],[146,0,146,1],[146,2,146,4],[140,0,140,1],[141,0,141,1],[141,2,141,4],[142,0,142,1],[142,2,142,4],[143,0,143,1],[143,2,143,4],[155,0,156,1],[155,2,156,4],[155,5,156,5],[155,6,156,6],[157,16,157,17],[157,19,157,21],[147,0,147,1],[147,2,147,4],[150,0,150,1],[150,2,150,4],[151,0,151,1],[151,2,151,4],[170,16,170,17],[170,19,170,21],[173,15,173,17],[173,19,173,21],[177,18,177,21],[158,0,158,26],[159,0,159,1],[165,0,165,1],[166,0,166,1],[167,0,167,1],[169,0,169,1]]}
["Númer verkþáttar",null,"Heiti verkþáttar",null,null,"Magn","Eining",null,"Flokkur, gróft","Flokkur, ítarlegt","Yfirverkþáttur","Undirverkþáttur","Efni","Magn","Eining","Efni","Flutningsvegalengd [km]",null,"Olíunotkun [L]","Annað",null,null,"Losun (kg CO2-íg.)"]
[null,null,null,null,null,null,null,null,null,null,null,null,null,null,null,null,"Á sjó","Innanlands","Magn","Magn","Eining","Skýring","A1-A3","A4","A5","A1-A5","B4","A1-A5 + B4"]
["Skeringar og undirbygging"]
["32.1",null,"Bergskeringar í vegstæði",null,null,0,"m3 ",null,"Jarðvinna","Jarðvinna, bergskeringar","Skeringar og undirbygging","32.1 Bergskeringar í vegstæði","Fast berg",{"$f":"F4*m_V_spr","v":0},"kg","Sprengiefni",1500,50,{"$f":"F4*Oil_bor","v":0},{"$f":"N4","v":0},"kg","Sprengiefni",{"$f":"N4*EF_spr","v":0},{"$f":"N4/1000*Q4*EF_fl_s+N4/1000*R4*EF_fl_i","v":0},{"$f":"S4*EF_oil+T4*EF_spr","v":0},{"$f":"SUM(W4:Y4)","v":0},null,{"$f":"SUM(Z4:AA4)","v":0}]
["32.2",null,"Bergskeringar í námu",null,null,0,"m3 ",null,"Jarðvinna","Jarðvinna, bergskeringar","Skeringar og undirbygging","32.2 Bergskeringar í námu","Fast berg",{"$f":"F5*m_V_spr","v":0},"kg","Sprengiefni",1500,50,{"$f":"F5*Oil_bor","v":0},{"$f":"N5","v":0},"kg","Sprengiefni",{"$f":"N5*EF_spr","v":0},{"$f":"N5/1000*Q5*EF_fl_s+N5/1000*R5*EF_fl_i","v":0},{"$f":"S5*EF_oil+T5*EF_spr","v":0},{"$f":"SUM(W5:Y5)","v":0},null,{"$f":"SUM(Z5:AA5)","v":0}]
["33.1",null,"Fyllingarefni úr skeringum",null,null,null,null,null,null,null,null,null,null,null,null,null,null,null,null,null,null,null,null,null,null,null,null,0]
[null,null,"Þar af laust fyllingarefni",null,null,0,"m3 ",null,"Jarðvinna","Jarðvinna, fyllingarefni","Skeringar og undirbygging","33.1 Fyllingarefni úr skeringum","Þjappað fyllingarefni",null,null,null,0,50,{"$f":"F7*(Oil_veg+Oil_grafa+Oil_yta+Oil_valt)","v":0},null,null,null,null,{"$f":"F7*mpV_fb/CF_þ_f*Q7*EF_fl_s+F7*mpV_fb/CF_þ_f*R7*EF_fl_mi","v":0},{"$f":"S7*EF_oil","v":0},0,null,0]
[null,null,"Þar af sprengt fyllingarefni",null,null,{"$f":"IF(F7<> \"\",F6-F7,\"\")","v":0},"m3 ",null,"Jarðvinna","Jarðvinna, fyllingarefni","Skeringar og undirbygging","33.1 Fyllingarefni úr skeringum","Þjappað fyllingarefni",null,null,null,0,50,{"$f":"F8*(Oil_grafa*2+Oil_yta+Oil_valt)","v":0},null,null,null,null,{"$f":"F8*mpV_fb/CF_þ_f*Q8*EF_fl_s+F8*mpV_fb/CF_þ_f*R8*EF_fl_mi","v":0},{"$f":"S8*EF_oil","v":0},0,null,0]
["33.2",null,"Fyllingarefni úr námu",null,null,0,"m3 ",null,null,null,null,null,null,null,null,null,null,null,null,null,null,null,null,null,null,null,null,0]
[null,null,"Laust fyllingarefni",null,null,0,"m3 ",null,"Jarðvinna","Jarðvinna, fyllingarefni","Skeringar og undirbygging","33.2 Fyllingarefni úr námu","Þjappað fyllingarefni",null,null,null,0,50,{"$f":"F10*(Oil_grafa*2+Oil_yta+Oil_valt)","v":0},null,null,null,null,{"$f":"F10*mpV_fb/CF_þ_f*Q10*EF_fl_s+F10*mpV_fb/CF_þ_f*R10*EF_fl_mi","v":0},{"$f":"S10*EF_oil","v":0},0,null,0]
[null,null,"Sprengt fyllingarefni",null,null,{"$f":"IF(F10<> \"\",F9-F10,\"\")","v":0},"m3 ",null,"Jarðvinna","Jarðvinna, fyllingarefni","Skeringar og undirbygging","33.2 Fyllingarefni úr námu","Þjappað fyllingarefni",null,null,null,0,50,{"$f":"F11*(Oil_grafa*2+Oil_yta+Oil_valt)","v":0},null,null,null,null,{"$f":"F11*mpV_fb/CF_þ_f*Q11*EF_fl_s+F11*mpV_fb/CF_þ_f*R11*EF_fl_mi","v":0},{"$f":"S11*EF_oil","v":0},0,null,0]
["34.1",null,"Fláafleygar, efni úr skeringum",null,null,0,"m3 ",null,"Jarðvinna","Jarðvinna, fláafleygar","Skeringar og undirbygging","34.1 Fláafleygar, efni úr skeringum",null,null,null,null,0,50,{"$f":"F12*(Oil_veg+Oil_grafa+Oil_yta)","v":0},null,null,null,null,{"$f":"F12/1000*Q12*EF_fl_s+F12/1000*R12*EF_fl_mi","v":0},{"$f":"S12*EF_oil","v":0},0,null,0]
["34.8",null,"Ónothæfu efni jafnað á losunarstað",null,null,0,"m3 ",null,"Jarðvinna","Jarðvinna, ónothæft efni","Skeringar og undirbygging","34.8 Ónothæfu efni jafnað á losunarstað",null,null,null,null,0,50,{"$f":"F13*(Oil_veg+Oil_yta)","v":0},null,null,null,null,{"$f":"F13/1000*Q13*EF_fl_s+F13/1000*R13*EF_fl_mi","v":0},{"$f":"S13*EF_oil","v":0},0,null,0]
[null,null,null,null,null,null,null,null,null,null,null,null,null,null,null,null,"Heildarolíunotkun [L]",null,{"$f":"SUM(S4:S13)","v":0},"Skeringar og undirbygging samtals",null,null,{"$f":"SUM(W4:W13)","v":0},0,0,0,0,0]
["Ræsi og veitur"]
["45.71",null,"Plaströr, vatnsveita"]
[null,null,"Vatnsveiturör, D = 63 - 200 mm",null,null,0,"m",null,"Plast","Plast, Vatnsveiturör","Ræsi og veitur","45.71 Plaströr, vatnsveita","Plaströr",{"$f":"F17*mpl_VVror_02","v":0},"kg","Plast, PE",1500,50,null,null,null,null,{"$f":"N17*EF_VV_PE","v":0},{"$f":"N17/1000*Q17*EF_fl_s+N17/1000*R17*EF_fl_i","v":0},null,{"$f":"SUM(W17:Y17)","v":0},null,{"$f":"SUM(Z17:AA17)","v":0}]
[null,null,"Vatnsveiturör, D = 201 - 400  mm",null,null,0,"m",null,"Plast","Plast, Vatnsveiturör","Ræsi og veitur","45.71 Plaströr, vatnsveita","Plaströr",{"$f":"F18*mpl_VVror_04","v":0},"kg","Plast, PE",1500,50,null,null,null,null,0,0,null,0,null,0]
[null,null,"Vatnsveiturör, D = 401 - 600  mm",null,null,0,"m",null,"Plast","Plast, Vatnsveiturör","Ræsi og veitur","45.71 Plaströr, vatnsveita","Plaströr",{"$f":"F19*mpl_VVror_06","v":0},"kg","Plast, PE",1500,50,null,null,null,null,0,0,null,0,null,0]
[null,null,"Vatnsveiturör, D = 601 - 800  mm",null,null,0,"m",null,"Plast","Plast, Vatnsveiturör","Ræsi og veitur","45.71 Plaströr, vatnsveita","Plaströr",{"$f":"F20*mpl_VVror_08","v":0},"kg","Plast, PE",1500,50,null,null,null,null,0,0,null,0,null,0]
[null,null,"Vatnsveiturör, D = 801 - 1000  mm",null,null,0,"m",null,"Plast","Plast, Vatnsveiturör","Ræsi og veitur","45.71 Plaströr, vatnsveita","Plaströr",{"$f":"F21*mpl_VVror_10","v":0},"kg","Plast, PE",1500,50,null,null,null,null,0,0,null,0,null,0]
[null,null,"Vatnsveiturör, D = 1001 - 1200  mm",null,null,0,"m",null,"Plast","Plast, Vatnsveiturör","Ræsi og veitur","45.71 Plaströr, vatnsveita","Plaströr",{"$f":"F22*mpl_VVror_12","v":0},"kg","Plast, PE",1500,50,null,null,null,null,0,0,null,0,null,0]
["42.3",null,"Plaströr, fráveita"]
[null,null,"Fráveiturör, D = 250 - 400 mm",null,null,0,"m",null,"Plast","Plast, fráveiturör","Ræsi og veitur","42.3 Plaströr, fráveita","Plaströr",{"$f":"F24*mpl_FVror_04","v":0},"kg","Plast, X-Stream",1500,50,null,null,null,null,{"$f":"N24*EF_FV_Xstr","v":0},{"$f":"N24/1000*Q24*EF_fl_s+N24/1000*R24*EF_fl_i","v":0},null,{"$f":"SUM(W24:Y24)","v":0},null,0]
[null,null,"Fráveiturör, D = 401 - 600 mm",null,null,0,"m",null,"Plast","Plast, fráveiturör","Ræsi og veitur","42.3 Plaströr, fráveita","Plaströr",{"$f":"F25*mpl_FVror_06","v":0},"kg","Plast, X-Stream",1500,50,null,null,null,null,{"$f":"N25*EF_FV_Xstr","v":0},0,null,0,null,0]
[null,null,"Fráveiturör, D = 601 - 800 mm",null,null,0,"m",null,"Plast","Plast, fráveiturör","Ræsi og veitur","42.3 Plaströr, fráveita","Plaströr",{"$f":"F26*mpl_FVror_08","v":0},"kg","Plast, X-Stream",1500,50,null,null,null,null,{"$f":"N26*EF_FV_Xstr","v":0},0,null,0,null,0]
[null,null,"Fráveiturör, D = 801 - 1000 mm",null,null,0,"m",null,"Plast","Plast, fráveiturör","Ræsi og veitur","42.3 Plaströr, fráveita","Plaströr",{"$f":"F27*mpl_FVror_10","v":0},"kg","Plast, Weholite",1500,50,null,null,null,null,{"$f":"N27*EF_FV_Weh","v":0},0,null,0,null,0]
[null,null,"Fráveiturör, D = 1001 - 1400 mm",null,null,0,"m",null,"Plast","Plast, fráveiturör","Ræsi og veitur","42.3 Plaströr, fráveita","Plaströr",{"$f":"F28*mpl_FVror_14","v":0},"kg","Plast, Weholite",1500,50,null,null,null,null,{"$f":"N28*EF_FV_Weh","v":0},0,null,0,null,0]
[null,null,"Fráveiturör, D = 1401 - 1800 mm",null,null,0,"m",null,"Plast","Plast, fráveiturör","Ræsi og veitur","42.3 Plaströr, fráveita","Plaströr",{"$f":"F29*mpl_FVror_18","v":0},"kg","Plast, Weholite",1500,50,null,null,null,null,{"$f":"N29*EF_FV_Weh","v":0},0,null,0,null,0]
[null,null,"Fráveiturör, D = 1801 - 2200 mm",null,null,0,"m",null,"Plast","Plast, fráveiturör","Ræsi og veitur","42.3 Plaströr, fráveita","Plaströr",{"$f":"F30*mpl_FVror_22","v":0},"kg","Plast, Weholite",1500,50,null,null,null,null,{"$f":"N30*EF_FV_Weh","v":0},0,null,0,null,0]
[null,null,"Fráveiturör, D > 2200 mm",null,null,0,"m",null,"Plast","Plast, fráveiturör","Ræsi og veitur","42.3 Plaströr, fráveita","Plaströr",{"$f":"F31*mpl_FVror_22p","v":0},"kg","Plast, Weholite",1500,50,null,null,null,null,{"$f":"N31*EF_FV_Weh","v":0},0,null,0,null,0]
["45.72",null,"Hitaveiturör"]
[null,null,"Hitaveiturör, D = 250 mm",null,null,0,"m",null,"Stál","Stál, hitaveiturör","Ræsi og veitur","45.72 Hitaveiturör","PUR-einangrað stálrör",{"$f":"F33","v":0},"m","Einangrað stálrör",1500,50,null,null,null,null,{"$f":"N33*EF_Hvror_025","v":0},{"$f":"N33/1000*Q33*EF_fl_s+N33/1000*R33*EF_fl_i","v":0},null,{"$f":"SUM(W33:Y33)","v":0},null,0]
[null,null,"Hitaveiturör, D = 300 mm",null,null,0,"m",null,"Stál","Stál, hitaveiturör","Ræsi og veitur","45.72 Hitaveiturör","PUR-einangrað stálrör",0,"m","Einangrað stálrör",null,null,null,null,null,null,{"$f":"N34*EF_Hvror_03","v":0},0,null,0,null,0]
[null,null,"Hitaveiturör, D = 350 mm",null,null,0,"m",null,"Stál","Stál, hitaveiturör","Ræsi og veitur","45.72 Hitaveiturör","PUR-einangrað stálrör",0,"m","Einangrað stálrör",null,null,null,null,null,null,{"$f":"N35*EF_Hvror_035","v":0},0,null,0,null,0]
[null,null,"Hitaveiturör, D = 400 mm",null,null,0,"m",null,"Stál","Stál, hitaveiturör","Ræsi og veitur","45.72 Hitaveiturör","PUR-einangrað stálrör",0,"m","Einangrað stálrör",1500,50,null,null,null,null,{"$f":"N36*EF_Hvror_04","v":0},0,null,0,null,0]
[null,null,"Hitaveiturör, D = 450 mm",null,null,0,"m",null,"Stál","Stál, hitaveiturör","Ræsi og veitur","45.72 Hitaveiturör","PUR-einangrað stálrör",0,"m","Einangrað stálrör",1500,50,null,null,null,null,{"$f":"N37*EF_Hvror_045","v":0},0,null,0,null,0]
[null,null,"Hitaveiturör, D = 500 mm",null,null,0,"m",null,"Stál","Stál, hitaveiturör","Ræsi og veitur","45.72 Hitaveiturör","PUR-einangrað stálrör",0,"m","Einangrað stálrör",null,null,null,null,null,null,{"$f":"N38*EF_Hvror_05","v":0},0,null,0,null,0]
[null,null,"Hitaveiturör, D = 600 mm",null,null,0,"m",null,"Stál","Stál, hitaveiturör","Ræsi og veitur","45.72 Hitaveiturör","PUR-einangrað stálrör",0,"m","Einangrað stálrör",null,null,null,null,null,null,{"$f":"N39*EF_Hvror_06","v":0},0,null,0,null,0]
[null,null,"Hitaveiturör, D = 700 mm",null,null,0,"m",null,"Stál","Stál, hitaveiturör","Ræsi og veitur","45.72 Hitaveiturör","PUR-einangrað stálrör",0,"m","Einangrað stálrör",1500,50,null,null,null,null,{"$f":"N40*EF_Hvror_07","v":0},0,null,0,null,0]
[null,null,"Hitaveiturör, D = 800 mm",null,null,0,"m",null,"Stál","Stál, hitaveiturör","Ræsi og veitur","45.72 Hitaveiturör","PUR-einangrað stálrör",0,"m","Einangrað stálrör",1500,50,null,null,null,null,{"$f":"N41*EF_Hvror_08","v":0},0,null,0,null,0]
["42.4",null,"Stálrör í ræsi"]
[null,42412,"Stálrör, D = 0,3 m",null,null,0,"m",null,"Stál","Stál, ræsi","Ræsi og veitur","42.4 Stálrör í ræsi","Stálrör",{"$f":"F43*mpl_Stalror_03","v":0},"kg","Stál",1500,50,null,null,null,null,{"$f":"N43*EF_Stal_ror","v":0},{"$f":"N43/1000*Q43*EF_fl_s+N43/1000*R43*EF_fl_i","v":0},null,{"$f":"SUM(W43:Y43)","v":0},null,0]
[null,42415,"Stálrör, D = 0,6 m",null,null,0,"m",null,"Stál","Stál, ræsi","Ræsi og veitur","42.4 Stálrör í ræsi","Stálrör",{"$f":"F44*mpl_Stalror_06","v":0},"kg","Stál",1500,50,null,null,null,null,0,0,null,0,null,0]
[null,42417,"Stálrör, D = 0,8 m",null,null,0,"m",null,"Stál","Stál, ræsi","Ræsi og veitur","42.4 Stálrör í ræsi","Stálrör",{"$f":"F45*mpl_Stalror_08","v":0},"kg","Stál",1500,50,null,null,null,null,0,0,null,0,null,0]
[null,42422,"Stálrör, D = 1,0 m",null,null,0,"m",null,"Stál","Stál, ræsi","Ræsi og veitur","42.4 Stálrör í ræsi","Stálrör",{"$f":"F46*mpl_Stalror_10","v":0},"kg","Stál",1500,50,null,null,null,null,0,0,null,0,null,0]
[null,42424,"Stálrör, D = 1,2 m",null,null,0,"m",null,"Stál","Stál, ræsi","Ræsi og veitur","42.4 Stálrör í ræsi","Stálrör",{"$f":"F47*mpl_Stalror_12","v":0},"kg","Stál",1500,50,null,null,null,null,0,0,null,0,null,0]
[null,42428,"Stálrör, D = 1,6 m",null,null,0,"m",null,"Stál","Stál, ræsi","Ræsi og veitur","42.4 Stálrör í ræsi","Stálrör",{"$f":"F48*mpl_Stalror_16","v":0},"kg","Stál",1500,50,null,null,null,null,0,0,null,0,null,0]
[null,42432,"Stálrör, D = 2,0 m",null,null,0,"m",null,"Stál","Stál, ræsi","Ræsi og veitur","42.4 Stálrör í ræsi","Stálrör",{"$f":"F49*mpl_Stalror_20","v":0},"kg","Stál",1500,50,null,null,null,null,0,0,null,0,null,0]
[null,42442,"Stálrör, D >= 3,0 m",null,null,0,"m",null,"Stál","Stál, ræsi","Ræsi og veitur","42.4 Stálrör í ræsi","Stálrör",{"$f":"F50*mpl_Stalror_30","v":0},"kg","Stál",1500,50,null,null,null,null,0,0,null,0,null,0]
["45.4",null,"Steypt ofanvatnsræsi"]
[null,"45.41","Steypt ofanvatnsræsi, D < 120 mm",null,null,0,"m",null,"Steypa","Steypa, ofanvatnsræsi","Ræsi og veitur","45.4 Steypt ofanvatnsræsi","Steypt rör",{"$f":"F52*mpl_Stror_120","v":0},"kg","Steypt rör",1500,200,null,null,null,null,{"$f":"N52/mpV_steypa*EF_St_ror","v":0},{"$f":"N52/1000*Q52*EF_fl_s+N52/1000*R52*EF_fl_i","v":0},null,{"$f":"SUM(W52:Y52)","v":0},null,0]
[null,"45.42","Steypt ofanvatnsræsi, D = 120 - 300 mm",null,null,0,"m",null,"Steypa","Steypa, ofanvatnsræsi","Ræsi og veitur","45.4 Steypt ofanvatnsræsi","Steypt rör",{"$f":"F53*mpl_Stror_300","v":0},"kg","Steypt rör",1500,200,null,null,null,null,{"$f":"N53/mpV_steypa*EF_St_ror","v":0},{"$f":"N53/1000*Q53*EF_fl_s+N53/1000*R53*EF_fl_i","v":0},null,0,null,0]
[null,"45.43","Steypt ofanvatnsræsi, D = 301 - 600 mm",null,null,0,"m",null,"Steypa","Steypa, ofanvatnsræsi","Ræsi og veitur","45.4 Steypt ofanvatnsræsi","Steypt rör",{"$f":"F54*mpl_Stror_600","v":0},"kg","Steypt rör",1500,200,null,null,null,null,{"$f":"N54/mpV_steypa*EF_St_ror","v":0},{"$f":"N54/1000*Q54*EF_fl_s+N54/1000*R54*EF_fl_i","v":0},null,0,null,0]
[null,"45.44","Steypt ofanvatnsræsi, D = 601 - 1000 mm",null,null,0,"m",null,"Steypa","Steypa, ofanvatnsræsi","Ræsi og veitur","45.4 Steypt ofanvatnsræsi","Steypt rör",{"$f":"F55*mpl_Stror_1000","v":0},"kg","Steypt rör",1500,200,null,null,null,null,{"$f":"N55/mpV_steypa*EF_St_ror","v":0},{"$f":"N55/1000*Q55*EF_fl_s+N55/1000*R55*EF_fl_i","v":0},null,0,null,0]
[null,"45.45","Steypt ofanvatnsræsi, D > 1000 mm",null,null,0,"m",null,"Steypa","Steypa, ofanvatnsræsi","Ræsi og veitur","45.4 Steypt ofanvatnsræsi","Steypt rör",{"$f":"F56*mpl_Stror_1000p","v":0},"kg","Steypt rör",1500,200,null,null,null,null,{"$f":"N56/mpV_steypa*EF_St_ror","v":0},{"$f":"N56/1000*Q56*EF_fl_s+N56/1000*R56*EF_fl_i","v":0},null,0,null,0]
["45.5",null,"Brunnar (plastbrunnar með steyptum flotkarmi og stálloki)"]
[null,null,"Brunnur, D = 600 mm, dýpt = 0-2,5 m",null,null,0,"stk",null,"Plast","Plast, brunnur","Ræsi og veitur","45.5 Brunnar","PP brunnur",{"$f":"F58*(mpst_Br_06+mpl_BrUp_06*1)","v":0},"kg","Plast, PP",1500,50,null,null,null,null,{"$f":"N58*EF_PP","v":0},{"$f":"N58/1000*Q58*EF_fl_s+N58/1000*R58*EF_fl_i","v":0},null,0,null,{"$f":"SUM(Z58:AA58)","v":0}]
[null,null,null,null,null,null,null,null,"Steypa","Steypa, flotkarmur","Ræsi og veitur","45.5 Brunnar",null,{"$f":"F58*mpst_flotk","v":0},"kg","Steyptur flotkarmur",1500,50,null,null,null,null,{"$f":"N59/mpV_steypa*EF_St_ror","v":0},0,null,0,null,{"$f":"SUM(Z59:AA59)","v":0}]
[null,null,null,null,null,null,null,null,"Stál","Stál, brunnlok","Ræsi og veitur","45.5 Brunnar",null,{"$f":"F58*mpst_br_lok","v":0},"kg","Stállok",1500,50,null,null,null,null,{"$f":"N60*EF_Stal_ror","v":0},0,null,0,null,0]
[null,null,"Brunnur, D = 600 mm, dýpt > 2,5 m",null,null,0,"stk",null,"Plast","Plast, brunnur","Ræsi og veitur","45.5 Brunnar","PP brunnur",{"$f":"F61*(mpst_Br_06+mpl_BrUp_06*3)","v":0},"kg","Plast, PP",1500,50,null,null,null,null,{"$f":"N61*EF_PP","v":0},0,null,0,null,0]
[null,null,null,null,null,null,null,null,"Steypa","Steypa, flotkarmur","Ræsi og veitur","45.5 Brunnar",null,{"$f":"F61*mpst_flotk","v":0},"kg","Steyptur flotkarmur",1500,50,null,null,null,null,{"$f":"N62*EF_St_ror","v":0},0,null,0,null,0]
[null,null,null,null,null,null,null,null,"Stál","Stál, brunnlok","Ræsi og veitur","45.5 Brunnar",null,{"$f":"F61*mpst_br_lok","v":0},"kg","Stállok",1500,50,null,null,null,null,{"$f":"N63*EF_Stal_ror","v":0},0,null,0,null,0]
[null,null,"Brunnur, D = 1000 mm, dýpt = 0-2,5 m",null,null,0,"stk",null,"Plast","Plast, brunnur","Ræsi og veitur","45.5 Brunnar","PP brunnur",{"$f":"F64*(mpst_Br_10+mpl_BrUp_10*1)","v":0},"kg","Plast, PP",1500,50,null,null,null,null,{"$f":"N64*EF_PP","v":0},0,null,0,null,0]
[null,null,null,null,null,null,null,null,"Steypa","Steypa, flotkarmur","Ræsi og veitur","45.5 Brunnar",null,{"$f":"F64*mpst_flotk","v":0},"kg","Steyptur flotkarmur",1500,50,null,null,null,null,{"$f":"N65*EF_St_ror","v":0},0,null,0,null,0]
[null,null,null,null,null,null,null,null,"Stál","Stál, brunnlok","Ræsi og veitur","45.5 Brunnar",null,{"$f":"F64*mpst_br_lok","v":0},"kg","Stállok",1500,50,null,null,null,null,{"$f":"N66*EF_Stal_ror","v":0},0,null,0,null,0]
[null,null,"Brunnur, D = 1000 mm, dýpt > 2,5 m",null,null,0,"stk",null,"Plast","Plast, brunnur","Ræsi og veitur","45.5 Brunnar","PP brunnur",{"$f":"F67*(mpst_Br_10+mpl_BrUp_10*3)","v":0},"kg","Plast, PP",1500,50,null,null,null,null,{"$f":"N67*EF_PP","v":0},0,null,0,null,0]
[null,null,null,null,null,null,null,null,"Steypa","Steypa, flotkarmur","Ræsi og veitur","45.5 Brunnar",null,{"$f":"F67*mpst_flotk","v":0},"kg","Steyptur flotkarmur",1500,50,null,null,null,null,{"$f":"N68*EF_St_ror","v":0},0,null,0,null,0]
[null,null,null,null,null,null,null,null,"Stál","Stál, brunnlok","Ræsi og veitur","45.5 Brunnar",null,{"$f":"F67*mpst_br_lok","v":0},"kg","Stállok",1500,50,null,null,null,null,{"$f":"N69*EF_Stal_ror","v":0},0,null,0,null,0]
["45.6",null,"Niðurföll / sandfang",null,null,0,"stk",null,"Plast","Plast, niðurfall","Ræsi og veitur","45.6 Niðurföll / sandfang","PP niðurfall",{"$f":"F70*mpst_nfall","v":0},"kg","Plast, PP",1500,50,null,null,null,null,{"$f":"N70*EF_PP","v":0},0,null,0,null,0]
["45.68",null,"Grjótsvelgur",null,null,null,null,null,"Plast","Plast, Grjótsvelgur","Ræsi og veitur","45.68 Grjótsvelgur"]
["45.1 + 45.8",null,"Gröftur lagnaskurða og fylling í skurði",null,null,0,"m3",null,"Jarðvinna","Jarðvinna, lagnaskurðir","Ræsi og veitur","45.1 + 45.8 Gröftur lagnaskurða og fylling í skurði","Þjappað fyllingarefni",null,null,null,0,10,{"$f":"F72*(Oil_grafa+Oil_grafa+Oil_yta)","v":0},null,null,null,null,{"$f":"F72*mpV_fb/CF_þ_f*Q72*EF_fl_s+F72*mpV_fb/CF_þ_f*R72*EF_fl_mi","v":0},{"$f":"S72*EF_oil","v":0},0,null,0]
[null,null,"Rafstrengir, ljósleiðari o.s.frv"]
[null,null,"Ljósleiðari",null,null,0,"m",null,"Rafstrengur","Rafstrengur","Ræsi og veitur","Rafstrengir","Ljósleiðari",{"$f":"F74","v":0},"m","Ljósleiðari",1500,50,null,null,null,null,{"$f":"N74*EF_ljosleid","v":0},{"$f":"N74*mpL_rafstr_1kv/1000*Q74*EF_fl_s+N74*mpL_rafstr_1kv/1000*R74*EF_fl_i","v":0},null,{"$f":"SUM(W74:Y74)","v":0},null,0]
[null,null,"Rafstrengur, lágspenna (< 11 kV)",null,null,0,"m",null,"Rafstrengur","Rafstrengur","Ræsi og veitur","Rafstrengir","Rafstrengur, 1 kV",{"$f":"F75","v":0},"m","Rafstrengur, 1 kV",1500,50,null,null,null,null,{"$f":"N75*EF_strengur_1kv","v":0},{"$f":"N75*mpL_rafstr_1kv/1000*Q75*EF_fl_s+N75*mpL_rafstr_1kv/1000*R75*EF_fl_i","v":0},null,{"$f":"SUM(W75:Y75)","v":0},null,0]
[null,null,"Rafstrengur, háspenna (≥ 11 kV)",null,null,0,"m",null,"Rafstrengur","Rafstrengur","Ræsi og veitur","Rafstrengir","Rafstrengur, 24 kV",{"$f":"F76","v":0},"m","Rafstrengur, 24 kV",1500,50,null,null,null,null,{"$f":"N76*EF_strengur_24kv","v":0},{"$f":"N76*mpL_rafstr_24kv/1000*Q76*EF_fl_s+N76*mpL_rafstr_24kv/1000*R76*EF_fl_i","v":0},null,0,null,0]
[null,null,null,null,null,null,null,null,null,null,null,null,null,null,null,null,"Heildarolíunotkun [L]",null,{"$f":"SUM(S16:S76)","v":0},"Ræsi og veitur samtals",null,null,{"$f":"SUM(W16:W76)","v":0},{"$f":"SUM(X16:X76)","v":0},0,0,0,0]
["Styrktar og burðarlög"]
["52.2",null,"Styrktarlag, unnið efni"]
[null,null,"Styrktarlag undir stíga",null,null,0,"m3",null,"Jarðvinna","Jarðvinna, styrktarlag","Styrktar- og burðarlög","52.2 Styrktarlag","Þjappað styrktarlagsefni",null,null,null,0,10,{"$f":"F80*(Oil_vin+Oil_grafa+Oil_yta+Oil_valt)","v":0},null,null,null,null,{"$f":"F80*mpV_fb/CF_þ_f*Q80*EF_fl_s+F80*mpV_fb/CF_þ_f*R80*EF_fl_mi","v":0},{"$f":"S80*EF_oil","v":0},{"$f":"SUM(W80:Y80)","v":0},null,{"$f":"SUM(Z80:AA80)","v":0}]
[null,null,"Styrktarlag undir vegi",null,null,0,"m3",null,"Jarðvinna","Jarðvinna, styrktarlag","Styrktar- og burðarlög","52.2 Styrktarlag","Þjappað styrktarlagsefni",null,null,null,0,10,{"$f":"F81*(Oil_vin+Oil_grafa+Oil_yta+Oil_valt)","v":0},null,null,null,null,{"$f":"F81*mpV_fb/CF_þ_f*Q81*EF_fl_s+F81*mpV_fb/CF_þ_f*R81*EF_fl_mi","v":0},{"$f":"S81*EF_oil","v":0},{"$f":"SUM(W81:Y81)","v":0},null,{"$f":"SUM(Z81:AA81)","v":0}]
[null,null,"Styrktarlag undir hellur",null,null,0,"m3",null,"Jarðvinna","Jarðvinna, styrktarlag","Styrktar- og burðarlög","52.2 Styrktarlag","Þjappað styrktarlagsefni",null,null,null,0,10,{"$f":"F82*(Oil_vin+Oil_grafa+Oil_yta+Oil_valt)","v":0},null,null,null,null,{"$f":"F82*mpV_fb/CF_þ_f*Q82*EF_fl_s+F82*mpV_fb/CF_þ_f*R82*EF_fl_mi","v":0},{"$f":"S82*EF_oil","v":0},{"$f":"SUM(W82:Y82)","v":0},null,0]
[null,null,"Styrktarlag undir gangstéttir",null,null,0,"m3",null,"Jarðvinna","Jarðvinna, styrktarlag","Styrktar- og burðarlög","52.2 Styrktarlag","Þjappað styrktarlagsefni",null,null,null,0,10,{"$f":"F83*(Oil_vin+Oil_grafa+Oil_yta+Oil_valt)","v":0},null,null,null,null,{"$f":"F83*mpV_fb/CF_þ_f*Q83*EF_fl_s+F83*mpV_fb/CF_þ_f*R83*EF_fl_mi","v":0},{"$f":"S83*EF_oil","v":0},{"$f":"SUM(W83:Y83)","v":0},null,0]
["53.1",null,"Óbundið burðarlag",null,null,0,"m3",null,"Jarðvinna","Jarðvinna, burðarlag","Styrktar- og burðarlög","53.1 Óbundið burðarlag","Þjappað burðarlagsefni",null,null,null,0,10,{"$f":"F84*(Oil_vinm+Oil_grafa+Oil_yta+Oil_valt)","v":0},null,null,null,null,{"$f":"F84*mpV_fb/CF_þ_f*Q84*EF_fl_s+F84*mpV_fb/CF_þ_f*R84*EF_fl_mi","v":0},{"$f":"S84*EF_oil","v":0},{"$f":"SUM(W84:Y84)","v":0},{"$f":"Z84*(_xlfn.CEILING.MATH(Forsíða!$D$8/ET_bur_ob)-1)","v":0},0]
[null,null,null,null,null,null,null,null,null,null,null,null,null,null,null,null,"Heildarolíunotkun [L]",null,{"$f":"SUM(S79:S84)","v":0},"Styrktar og burðarlög samtals",null,null,{"$f":"SUM(W79:W84)","v":0},{"$f":"SUM(X79:X84)","v":0},0,0,0,{"$f":"SUM(AB79:AB84)","v":0}]
["53.4",null,"Bikbundið burðarlag",null,null,"Geyma"]
["53.5",null,"Sementsbundið burðarlag",null,null,"Geyma"]
["Slitlög"]
["62.1",null,"Klæðing, nýlögn",null,null,0,"m2",null,"Klæðing","Klæðing","Slitlög","62.1 Klæðing, nýlögn","Tvöföld klæðing",null,"kg","Klæðingarefni",0,50,{"$f":"F89*oil_klaed","v":0},null,null,null,{"$f":"F89*EF_klaed","v":0},null,{"$f":"S89*EF_oil","v":0},{"$f":"SUM(W89:Y89)","v":0},{"$f":"Z89*(_xlfn.CEILING.MATH(Forsíða!$D$8/ET_klaeding)-1-_xlfn.CEILING.MATH(Forsíða!$D$8/ET_bur_ob))*0.5+Z89*(_xlfn.CEILING.MATH(Forsíða!$D$8/ET_bur_ob)-1)","v":0},{"$f":"SUM(Z89:AA89)","v":0}]
["63.42",null,"Burðarlagsmalbik","Veldu þykkt","mm",0,"m2",null,"Malbik","Malbik, burðarlag","Slitlög","63.42 Burðarlagsmalbik","Burðarlagsmalbik",{"$f":"IFERROR(IF(F90=0,0,F90*D90/1000*mpV_malb),\"Veldu þykkt\")","v":0},"kg","Burðarlagsmalbik",0,50,{"$f":"F90*d_malb*mpV_malb*oil_malb","v":0},null,null,null,{"$f":"N90*EF_malb_bur","v":0},{"$f":"N90/1000*Q90*EF_fl_s+N90/1000*R90*EF_fl_i","v":0},{"$f":"S90*EF_oil","v":0},0,{"$f":"Z90*(_xlfn.CEILING.MATH(Forsíða!$D$8/ET_malb_bur)-1)","v":0},0]
["63.43",null,"Slitlagsmalbik",null,null,null,null,null,null,null,null,null,null,null,null,null,null,null,null,null,null,null,null,null,null,null,null,0]
[null,null,"Slitlagsmalbik, ÁDU > 15000 ","Veldu þykkt","mm",0,"m2",null,"Malbik","Malbik, slitlag","Slitlög","62.43 Slitlagsmalbik","Slitlagsmalbik",{"$f":"IFERROR(IF(F92=0,0,F92*D92/1000*mpV_malb),\"Veldu þykkt\")","v":0},"kg","Slitlagsmalbik",0,50,{"$f":"F92*d_malb*mpV_malb*oil_malb","v":0},null,null,null,{"$f":"IFERROR(N92*EF_malb_15,\"Veldu þykkt\")","v":0},{"$f":"IFERROR(N92/1000*Q92*EF_fl_s+N92/1000*R92*EF_fl_i,\"Veldu þykkt\")","v":0},{"$f":"S92*EF_oil","v":0},{"$f":"SUM(W92:Y92)","v":0},{"$f":"Z92*(_xlfn.CEILING.MATH(Forsíða!$D$8/ET_malb_15)-1)","v":0},0]
[null,null,"Slitlagsmalbik, ÁDU 3000 - 15000 ","Veldu þykkt","mm",0,"m2",null,"Malbik","Malbik, slitlag","Slitlög","62.43 Slitlagsmalbik","Slitlagsmalbik",{"$f":"IFERROR(F93*D93/1000*mpV_malb,\"Veldu þykkt\")","v":"Veldu þykkt"},"kg","Slitlagsmalbik",0,50,{"$f":"F93*d_malb*mpV_malb*oil_malb","v":0},null,null,null,{"$f":"IFERROR(N93*EF_malb_3_15,\"Veldu þykkt\")","v":"Veldu þykkt"},{"$f":"IFERROR(N93/1000*Q93*EF_fl_s+N93/1000*R93*EF_fl_i, \"Veldu þykkt\")","v":"Veldu þykkt"},{"$f":"S93*EF_oil","v":0},0,{"$f":"Z93*(_xlfn.CEILING.MATH(Forsíða!$D$8/ET_malb_3_15)-1)","v":0},0]
[null,null,"Slitlagsmalbik, ÁDU < 3000 og hjóla-/göngustígar","Veldu þykkt","mm",0,"m2",null,"Malbik","Malbik, slitlag","Slitlög","62.43 Slitlagsmalbik","Slitlagsmalbik",{"$f":"IFERROR(F94*D94/1000*mpV_malb,\"Veldu þykkt\")","v":"Veldu þykkt"},"kg","Slitlagsmalbik",0,50,{"$f":"F94*d_malb*mpV_malb*oil_malb","v":0},null,null,null,{"$f":"IFERROR(N94*EF_malb_3,\"Veldu þykkt\")","v":"Veldu þykkt"},{"$f":"IFERROR(N94/1000*Q94*EF_fl_s+N94/1000*R94*EF_fl_i,\"Veldu þykkt\")","v":"Veldu þykkt"},{"$f":"S94*EF_oil","v":0},0,{"$f":"Z94*(_xlfn.CEILING.MATH(Forsíða!$D$8/ET_malb_3)-1)","v":0},0]
["68.24",null,"Steypt gangstétt",null,null,0,"m2",null,"Steypa","Steypa, gangstétt","Slitlög","68.24 Steypt gangstétt","Steypt gangstétt",{"$f":"F95*d_gangs","v":0},"m3","Steypa",0,50,null,null,null,null,{"$f":"N95*EF_st_35_gang","v":0},{"$f":"N95*mpV_steypa/1000*Q95*EF_fl_s+N95*mpV_steypa/1000*R95*EF_fl_i","v":0},null,0,{"$f":"Z95*(_xlfn.CEILING.MATH(Forsíða!$D$8/ET_gangst_steypa)-1)","v":0},0]
["68.25",null,"Gangstígar/eyjar/hringtorg með hellum",null,null,null,null,null,null,null,null,null,null,null,null,null,null,null,null,null,null,null,null,null,null,null,null,0]
[null,null,"Gangstígar með hellum 6 cm þykkar",60,"mm",0,"m2",null,"Steypa","Steypa, hellur","Slitlög","68.25 Gangstígar/eyjarhringtorg með hellum","Hellur",{"$f":"F97*D97/1000*mpV_hellur","v":0},"kg","hellur",0,50,null,null,null,null,{"$f":"N97*EF_hellur","v":0},{"$f":"N97/1000*Q97*EF_fl_s+N97/1000*R97*EF_fl_i","v":0},null,{"$f":"SUM(W97:Y97)","v":0},{"$f":"Z97*(_xlfn.CEILING.MATH(Forsíða!$D$8/ET_gangst_hellur)-1)","v":0},0]
[null,null,"Gangstígar með hellum 8 cm þykkar",80,"mm",0,"m2",null,"Steypa","Steypa, hellur","Slitlög","68.25 Gangstígar/eyjarhringtorg með hellum","Hellur",{"$f":"F98*D98/1000*mpV_hellur","v":0},"kg","hellur",0,50,null,null,null,null,{"$f":"N98*EF_hellur","v":0},{"$f":"N98/1000*Q98*EF_fl_s+N98/1000*R98*EF_fl_i","v":0},null,0,{"$f":"Z98*(_xlfn.CEILING.MATH(Forsíða!$D$8/ET_gangst_hellur)-1)","v":0},0]
[null,null,null,null,null,null,null,null,null,null,null,null,null,null,null,null,"Heildarolíunotkun [L]",null,{"$f":"SUM(S89:S98)","v":0},"Slitlög samtals",null,null,{"$f":"SUM(W89:W98)","v":0},0,0,0,0,0]
["Öryggisbúnaður og frágangur"]
["74.4",null,"Grjótvörn 1 (>2 tonn)",null,null,0,"m3",null,"Jarðvinna","Jarðvinna, grjótvörn","Öryggisbúnaður og frágangur","74.4 Grjótvörn (>2 tonn)",null,{"$f":"F101","v":0},"m3","grjót >2 tonn",0,50,{"$f":"F101*Oil_grjot","v":0},null,null,null,{"$f":"N101*EF_grjot","v":0},{"$f":"F101*mpV_grjot*Q101*EF_fl_s+F101*mpV_grjot*R101*EF_fl_mi","v":0},{"$f":"S101*EF_oil","v":0},{"$f":"SUM(W101:Y101)","v":0},null,{"$f":"SUM(Z101:AA101)","v":0}]
["74.5",null,"Grjótvörn 2 (0,5-2 tonn)",null,null,0,"m3",null,"Jarðvinna","Jarðvinna, grjótvörn","Öryggisbúnaður og frágangur","74.5 Grjótvörn (0,5-2 tonn)",null,{"$f":"F102","v":0},"m3","grjót 0,5-2 tonn",0,50,{"$f":"F102*Oil_grjot","v":0},null,null,null,{"$f":"N102*EF_grjot","v":0},{"$f":"F102*mpV_grjot*Q102*EF_fl_s+F102*mpV_grjot*R102*EF_fl_mi","v":0},{"$f":"S102*EF_oil","v":0},0,null,0]
["74.6",null,"Grjótvörn 3 (<0,5 tonn)",null,null,0,"m3",null,"Jarðvinna","Jarðvinna, grjótvörn","Öryggisbúnaður og frágangur","74.6 Grjótvörn (<0,5 tonn)",null,{"$f":"F103","v":0},"m3","grjót <0,5 tonn",0,50,{"$f":"F103*Oil_grjot","v":0},null,null,null,{"$f":"N103*EF_grjot","v":0},{"$f":"F103*mpV_grjot*Q103*EF_fl_s+F103*mpV_grjot*R103*EF_fl_mi","v":0},{"$f":"S103*EF_oil","v":0},0,null,0]
["75.1",null,"Kantsteinar"]
[null,null,"Kantsteinn, hæð 20 cm",null,null,0,"m",null,"Steypa","Steypa, kantsteinn","Öryggisbúnaður og frágangur","75.1 Kantsteinar","Járnbent steypa",{"$f":"F105*Vpl_kant_st_20","v":0},"m3","steypa",0,50,null,null,null,null,{"$f":"N105*EF_st_35_kant","v":0},{"$f":"N105*mpV_steypa/1000*Q105*EF_fl_s+N105*mpV_steypa/1000*R105*EF_fl_i","v":0},null,0,{"$f":"Z105*(_xlfn.CEILING.MATH(Forsíða!$D$8/ET_kantst)-1)","v":0},0]
[null,null,null,null,null,null,null,null,"Stál","Kambstál, kansteinn","Öryggisbúnaður og frágangur","75.1 Kantsteinar",null,{"$f":"F105*mpl_kant_stal_20","v":0},"kg","járnalögn",1500,50,null,null,null,null,{"$f":"N106*EF_kamb","v":0},{"$f":"N106/1000*Q106*EF_fl_s+N106/1000*R106*EF_fl_i","v":0},null,0,{"$f":"Z106*(_xlfn.CEILING.MATH(Forsíða!$D$8/ET_kantst)-1)","v":0},0]
[null,null,"Kantsteinn, hæð 15 cm",null,null,0,"m",null,"Steypa","Steypa, kantsteinn","Öryggisbúnaður og frágangur","75.1 Kantsteinar","Járnbent steypa",{"$f":"F107*Vpl_kant_st_15","v":0},"m3","steypa",0,50,null,null,null,null,{"$f":"N107*EF_st_35_kant","v":0},{"$f":"N107*mpV_steypa/1000*Q107*EF_fl_s+N107*mpV_steypa/1000*R107*EF_fl_i","v":0},null,0,{"$f":"Z107*(_xlfn.CEILING.MATH(Forsíða!$D$8/ET_kantst)-1)","v":0},0]
[null,null,null,null,null,null,null,null,"Stál","Kambstál, kansteinn","Öryggisbúnaður og frágangur","75.1 Kantsteinar",null,{"$f":"F107*mpl_kant_stal_15","v":0},"kg","járnalögn",1500,50,null,null,null,null,{"$f":"N108*EF_kamb","v":0},{"$f":"N108/1000*Q108*EF_fl_s+N108/1000*R108*EF_fl_i","v":0},null,0,{"$f":"Z108*(_xlfn.CEILING.MATH(Forsíða!$D$8/ET_kantst)-1)","v":0},0]
[null,null,"Kantsteinn, hæð 10 cm",null,null,0,"m",null,"Steypa","Steypa, kantsteinn","Öryggisbúnaður og frágangur","75.1 Kantsteinar","Járnbent steypa",{"$f":"F109*Vpl_kant_st_10","v":0},"m3","steypa",0,50,null,null,null,null,{"$f":"N109*EF_st_35_kant","v":0},{"$f":"N109*mpV_steypa/1000*Q109*EF_fl_s+N109*mpV_steypa/1000*R109*EF_fl_i","v":0},null,0,{"$f":"Z109*(_xlfn.CEILING.MATH(Forsíða!$D$8/ET_kantst)-1)","v":0},0]
[null,null,null,null,null,null,null,null,"Stál","Kambstál, kansteinn","Öryggisbúnaður og frágangur","75.1 Kantsteinar",null,{"$f":"F109*mpl_kant_stal_10","v":0},"kg","járnalögn",1500,50,null,null,null,null,{"$f":"N110*EF_kamb","v":0},{"$f":"N110/1000*Q110*EF_fl_s+N110/1000*R110*EF_fl_i","v":0},null,0,{"$f":"Z110*(_xlfn.CEILING.MATH(Forsíða!$D$8/ET_kantst)-1)","v":0},0]
["75.2",null,"Eyjar og hringtorg, jarðvinna, 30 cm lag",null,null,0,"m2",null,"Jarðvinna","Jarðvinna, eyjar","Öryggisbúnaður og frágangur","75.2 Eyjar og hringtorg",null,{"$f":"F111*d_eyja*(mpV_fb/CF_l_f)","v":0},"kg","jarðefni",0,50,{"$f":"F111*d_eyja*Oil_veg","v":0},null,null,null,null,{"$f":"N111*Q111*EF_fl_s+N111*R111*EF_fl_mi","v":0},{"$f":"S111*EF_oil","v":0},0,null,0]
["75.6",null,"Vegrið"]
[null,null,"Bitavegrið",null,null,0,"m",null,"Stál","Vegrið, galvaníserað stál","Öryggisbúnaður og frágangur","75.6 Vegrið",null,{"$f":"F113*mpl_bvegr","v":0},"kg","galvaníserað stál",1500,50,null,null,null,null,{"$f":"N113*EF_galvst_vegr","v":0},{"$f":"N113/1000*Q113*EF_fl_s+N113/1000*R113*EF_fl_i","v":0},null,0,{"$f":"Z113*(_xlfn.CEILING.MATH(Forsíða!$D$8/ET_bvegr)-1)","v":0},0]
[null,null,"Röravegrið",null,null,0,"m",null,"Stál","Vegrið, galvaníserað stál","Öryggisbúnaður og frágangur","75.6 Vegrið",null,{"$f":"F114*mpl_rvegr","v":0},"kg","galvaníserað stál",1500,50,null,null,null,null,{"$f":"N114*EF_galvst_vegr","v":0},{"$f":"N114/1000*Q114*EF_fl_s+N114/1000*R114*EF_fl_i","v":0},null,0,{"$f":"Z114*(_xlfn.CEILING.MATH(Forsíða!$D$8/ET_rvegr)-1)","v":0},0]
[null,null,"Víravegrið",null,null,0,"m",null,"Stál","Vegrið, stál","Öryggisbúnaður og frágangur","75.6 Vegrið",null,{"$f":"F115*mpl_vvegr","v":0},"kg","stál",1500,50,null,null,null,null,{"$f":"N115*EF_stal_vvegr","v":0},{"$f":"N115/1000*Q115*EF_fl_s+N115/1000*R115*EF_fl_i","v":0},null,0,{"$f":"Z115*(_xlfn.CEILING.MATH(Forsíða!$D$8/ET_vvegr)-1)","v":0},0]
[null,null,"Steypt vegrið","Varanlegt",null,0,"m",null,"Steypa","Vegrið, steypa","Öryggisbúnaður og frágangur","75.6 Vegrið",null,{"$f":"F116*Vpl_stevegr","v":0},"m3","steypa",0,50,null,null,null,null,{"$f":"IF(D116=\"Varanlegt\",N116*EF_st_35_vegr,N116*EF_st_35_vegr/8)","v":0},{"$f":"N116*mpV_steypa/1000*Q116*EF_fl_s+N116*mpV_steypa/1000*R116*EF_fl_i","v":0},null,0,null,0]
["76.45",null,"Ljósastaurar"]
[null,null,"Ljósastaur 4 m","Veldu fjölda ljóskera","ljósker á staur",0,"stk",null,"Stál","Ljósastaur, Galvaníserað stál","Öryggisbúnaður og frágangur","76.45 Ljósastuarar",null,{"$f":"F118*mpst_ljos_4","v":0},"kg","galvaníserað stál",1500,50,null,null,null,null,{"$f":"IFERROR(N118*EF_galvst_vegr,\"Veldu fjöldaljóskera\")","v":0},{"$f":"N118/1000*Q118*EF_fl_s+N118/1000*R118*EF_fl_i","v":0},null,0,{"$f":"Z118*(_xlfn.CEILING.MATH(Forsíða!$D$8/ET_ljstaur)-1)","v":0},0]
[null,null,null,null,null,null,null,null,"Stál","Ljósastaur, ljósker","Öryggisbúnaður og frágangur","76.45 Ljósastuarar",null,{"$f":"IFERROR(F118*D118,\"Ath.  innslátt\")","v":"Ath.  innslátt"},"stk","ljósker",1500,50,null,null,null,null,{"$f":"IFERROR(N119*EF_ljosker,\"Ath innslátt\")","v":"Ath innslátt"},null,null,0,{"$f":"Z119*(_xlfn.CEILING.MATH(Forsíða!$D$8/ET_ljosker)-1)","v":0},0]
[null,null,"Ljósastaur 5 m","Veldu fjölda ljóskera","ljósker á staur",0,"stk",null,"Stál","Ljósastaur, Galvaníserað stál","Öryggisbúnaður og frágangur","76.45 Ljósastuarar",null,{"$f":"F120*mpst_ljos_5","v":0},"kg","galvaníserað stál",1500,50,null,null,null,null,{"$f":"IFERROR(N120*EF_galvst_vegr,\"Veldu fjöldaljóskera\")","v":0},{"$f":"N120/1000*Q120*EF_fl_s+N120/1000*R120*EF_fl_i","v":0},null,0,{"$f":"Z120*(_xlfn.CEILING.MATH(Forsíða!$D$8/ET_ljstaur)-1)","v":0},0]
[null,null,null,null,null,null,null,null,"Stál","Ljósastaur, ljósker","Öryggisbúnaður og frágangur","76.45 Ljósastuarar",null,{"$f":"IFERROR(F120*D120,\"Ath. innslátt\")","v":"Ath. innslátt"},"stk","ljósker",1500,50,null,null,null,null,{"$f":"IFERROR(N121*EF_ljosker,\"Ath innslátt\")","v":"Ath innslátt"},null,null,0,{"$f":"Z121*(_xlfn.CEILING.MATH(Forsíða!$D$8/ET_ljosker)-1)","v":0},0]
[null,null,"Ljósastaur 6,3 m","Veldu fjölda ljóskera","ljósker á staur",0,"stk",null,"Stál","Ljósastaur, Galvaníserað stál","Öryggisbúnaður og frágangur","76.45 Ljósastuarar",null,{"$f":"F122*mpst_ljos_6","v":0},"kg","galvaníserað stál",1500,50,null,null,null,null,{"$f":"IFERROR(N122*EF_galvst_vegr,\"Veldu fjöldaljóskera\")","v":0},{"$f":"N122/1000*Q122*EF_fl_s+N122/1000*R122*EF_fl_i","v":0},null,0,{"$f":"Z122*(_xlfn.CEILING.MATH(Forsíða!$D$8/ET_ljstaur)-1)","v":0},0]
[null,null,null,null,null,null,null,null,"Stál","Ljósastaur, ljósker","Öryggisbúnaður og frágangur","76.45 Ljósastuarar",null,{"$f":"IFERROR(F122*D122,\"Ath. innslátt\")","v":"Ath. innslátt"},"stk","ljósker",1500,50,null,null,null,null,{"$f":"IFERROR(N123*EF_ljosker,\"Ath innslátt\")","v":"Ath innslátt"},null,null,0,{"$f":"Z123*(_xlfn.CEILING.MATH(Forsíða!$D$8/ET_ljosker)-1)","v":0},0]
[null,null,"Ljósastaur 8 m","Veldu fjölda ljóskera","ljósker á staur",0,"stk",null,"Stál","Ljósastaur, Galvaníserað stál","Öryggisbúnaður og frágangur","76.45 Ljósastuarar",null,{"$f":"F124*mpst_ljos_8","v":0},"kg","galvaníserað stál",1500,50,null,null,null,null,{"$f":"IFERROR(N124*EF_galvst_vegr,\"Veldu fjöldaljóskera\")","v":0},{"$f":"N124/1000*Q124*EF_fl_s+N124/1000*R124*EF_fl_i","v":0},null,{"$f":"SUM(W124:Y124)","v":0},{"$f":"Z124*(_xlfn.CEILING.MATH(Forsíða!$D$8/ET_ljstaur)-1)","v":0},0]
[null,null,null,null,null,null,null,null,"Stál","Ljósastaur, ljósker","Öryggisbúnaður og frágangur","76.45 Ljósastuarar",null,{"$f":"IFERROR(F124*D124,\"Ath. innslátt\")","v":"Ath. innslátt"},"stk","ljósker",1500,50,null,null,null,null,{"$f":"IFERROR(N125*EF_ljosker,\"Ath innslátt\")","v":"Ath innslátt"},null,null,0,{"$f":"Z125*(_xlfn.CEILING.MATH(Forsíða!$D$8/ET_ljosker)-1)","v":0},0]
[null,null,"Ljósastaur 10 m","Veldu fjölda ljóskera","ljósker á staur",0,"stk",null,"Stál","Ljósastaur, Galvaníserað stál","Öryggisbúnaður og frágangur","76.45 Ljósastuarar",null,{"$f":"F126*mpst_ljos_10","v":0},"kg","galvaníserað stál",1500,50,null,null,null,null,{"$f":"IFERROR(N126*EF_galvst_vegr,\"Veldu fjöldaljóskera\")","v":0},{"$f":"N126/1000*Q126*EF_fl_s+N126/1000*R126*EF_fl_i","v":0},null,{"$f":"SUM(W126:Y126)","v":0},{"$f":"Z126*(_xlfn.CEILING.MATH(Forsíða!$D$8/ET_ljstaur)-1)","v":0},0]
[null,null,null,null,null,null,null,null,"Stál","Ljósastaur, ljósker","Öryggisbúnaður og frágangur","76.45 Ljósastuarar",null,{"$f":"IFERROR(F126*D126,\"Ath. innslátt\")","v":"Ath. innslátt"},"stk","ljósker",1500,50,null,null,null,null,{"$f":"IFERROR(N127*EF_ljosker,\"Ath innslátt\")","v":"Ath innslátt"},null,null,0,{"$f":"Z127*(_xlfn.CEILING.MATH(Forsíða!$D$8/ET_ljosker)-1)","v":0},0]
["75.62",null,"Vegrið á brú",null,null,0,"m",null,"Stál","Vegrið, galvaníserað stál","Öryggisbúnaður og frágangur","75.62 Vegrið á brú",null,{"$f":"F128*mpl_rvegr_bru","v":0},"kg","galvaníserað stál",1500,50,null,null,null,null,{"$f":"N128*EF_galvst_vegr","v":0},{"$f":"N128/1000*Q128*EF_fl_s+N128/1000*R128*EF_fl_i","v":0},null,{"$f":"SUM(W128:Y128)","v":0},{"$f":"Z128*(_xlfn.CEILING.MATH(Forsíða!$D$8/ET_vegr_bru)-1)","v":0},0]
["75.7",null,"Handrið",null,null,0,"m",null,"Stál","Handrið, ryðfrítt stál","Öryggisbúnaður og frágangur","75.7 Handrið",null,{"$f":"F129*mpL_handr","v":0},"kg","Ryðfrítt stál",1500,50,null,null,null,null,{"$f":"N129*EF_St_bru_rf","v":0},{"$f":"N129/1000*Q129*EF_fl_s+N129/1000*R129*EF_fl_i","v":0},null,0,null,0]
[null,null,null,null,null,null,null,null,null,null,null,null,null,null,null,null,"Heildarolíunotkun [L]",null,{"$f":"SUM(S101:S129)","v":0},"Öryggisbúnaður og frágangur samtals",null,null,{"$f":"SUM(W101:W129)","v":0},{"$f":"SUM(X101:X129)","v":0},0,0,0,0]
["Brýr og steypt mannvirki"]
["83.11",null,"Bergboltar",null,null,0,"stk",null,"Stál","Kambstál, bergboltar","Brýr og steypt mannvirki","83.11 Bergboltar",null,{"$f":"F132*mpst_bergb_bru","v":0},"kg","Bergboltar úr kambstáli",1500,50,null,null,null,null,{"$f":"N132*EF_bergb","v":0},{"$f":"N132/1000*Q132*EF_fl_s+N132/1000*R132*EF_fl_i","v":0},null,{"$f":"SUM(W132:Y132)","v":0},null,{"$f":"SUM(Z132:AA132)","v":0}]
[83212,null,"Steyptir staurar"]
[null,null,"Steypa",null,null,0,"m3",null,"Steypa","Steypa, steyptir staurar í brú","Brýr og steypt mannvirki","83.212 Steyptir staurar",null,{"$f":"F134","v":0},"m3","Steypa",0,50,null,null,null,null,{"$f":"N134*EF_st_35","v":0},{"$f":"N134*mpV_steypa/1000*Q134*EF_fl_s+N134*mpV_steypa/1000*R134*EF_fl_i","v":0},null,0,null,{"$f":"SUM(Z134:AA134)","v":0}]
[null,null,"Járnalögn",null,null,0,"kg",null,"Stál","Kambstál, steyptir staurar í brú","Brýr og steypt mannvirki","83.212 Steyptir staurar",null,{"$f":"F135","v":0},"kg","kambstál",2000,50,null,null,null,null,{"$f":"N135*EF_kamb","v":0},{"$f":"N135/1000*Q135*EF_fl_s+N135/1000*R135*EF_fl_i","v":0},null,0,null,0]
[83222,null,"Tréstaurar",null,null,0,"m3","Límtré, sulur? G.r.f. límtré, slppa?","Timbur","Timbur, tréstaurar í brú","Brýr og steypt mannvirki","83.222 Tréstaurar",null,{"$f":"F136","v":0},"m3","Tré",1000,50,null,null,null,null,{"$f":"N136*EF_limtre","v":0},{"$f":"N136*mpV_timbur/1000*Q136*EF_fl_s+N136*mpV_timbur/1000*R136*EF_fl_i","v":0},null,0,null,0]
[83232,null,"Stálstaurar"]
[null,null,"Stálrör tómt",null,null,0,"kg",null,"Stál","Stál, stálstaurar í brú","Brýr og steypt mannvirki","83.232 Stálstaurar",null,{"$f":"F138","v":0},"kg","Stál",2000,50,null,null,null,null,{"$f":"F138*EF_St_bru","v":0},{"$f":"N138/1000*Q138*EF_fl_s+N138/1000*R138*EF_fl_i","v":0},null,0,null,0]
[null,null,"Steypa",null,null,0,"m3",null,"Steypa","Steypa, stálstaurar í brú","Brýr og steypt mannvirki","83.232 Stálstaurar",null,{"$f":"F139","v":0},"m3","Steypa",null,50,null,null,null,null,{"$f":"N139*EF_st_35","v":0},196.8,null,196.8,null,196.8]
[null,null,"Járnalögn ",null,null,0,"kg",null,"Stál","Kambstál, stálstaurar í brú","Brýr og steypt mannvirki","83.232 Stálstaurar",null,{"$f":"F140","v":0},"kg","kambstál",2000,50,null,null,null,null,{"$f":"N140*EF_kamb","v":0},{"$f":"N140/1000*Q140*EF_fl_s+N140/1000*R140*EF_fl_i","v":0},null,0,null,0]
["83.6",null,"Stálþil, efni","Varanlegt",null,0,"m2",null,"Stál","Stál, stálþil","Brýr og steypt mannvirki","83.6 Stálþil",null,{"$f":"F141*mpA_stalthil","v":0},"kg","stálþil",2000,50,null,null,null,null,{"$f":"IF(D141=\"Varanlegt\",N141*EF_stalthil,N141*EF_stalthil/3)","v":0},{"$f":"N141/1000*Q141*EF_fl_s+N141/1000*R141*EF_fl_i","v":0},null,0,null,0]
["84.2",null,"Mót",null,null,null,"m2","Veg LCA","Tré","Timbur, mót","Brýr og steypt mannvirki","84.2 Mót"]
["84.31",null,"Slakbent járnalögn ",null,null,0,"kg",null,"Stál","Kambstál, járnalögn í brú","Brýr og steypt mannvirki","84.31 Slakbent járnalögn",null,{"$f":"F143","v":0},"kg","kambstál",2000,50,null,null,null,null,{"$f":"N143*EF_kamb","v":0},{"$f":"N143/1000*Q143*EF_fl_s+N143/1000*R143*EF_fl_i","v":0},null,0,null,0]
["84.36",null,"Eftirspennt járnalögn",null,null,0,"kg",null,"Stál","Kambstál, járnalögn í brú","Brýr og steypt mannvirki","84.36 Eftirspennt járnalögn",null,{"$f":"F144","v":0},"kg","kambstál",2000,50,null,null,null,null,{"$f":"N144*EF_kamb","v":0},{"$f":"N144/1000*Q144*EF_fl_s+N144/1000*R144*EF_fl_i","v":0},null,0,null,0]
["84.4",null,"Steypa"]
[null,null,"Steypa C45/C55",null,null,0,"m3",null,"Steypa","Steypa, brú","Brýr og steypt mannvirki","84.4 Steypa",null,{"$f":"F146","v":0},"m3","Steypa",0,50,null,null,null,null,{"$f":"N146*EF_st_30","v":0},{"$f":"N146*mpV_steypa/1000*Q146*EF_fl_s+N146*mpV_steypa/1000*R146*EF_fl_i","v":0},null,0,null,0]
[null,null,"Steypa C35/C45",null,null,0,"m3",null,"Steypa","Steypa, brú","Brýr og steypt mannvirki","84.4 Steypa",null,{"$f":"F147","v":0},"m3","Steypa",0,50,null,null,null,null,{"$f":"N147*EF_st_35","v":0},{"$f":"N147*mpV_steypa/1000*Q147*EF_fl_s+N147*mpV_steypa/1000*R147*EF_fl_i","v":0},null,0,null,0]
[null,null,"Steypa C30/C37",null,null,0,"m3",null,"Steypa","Steypa, brú","Brýr og steypt mannvirki","84.4 Steypa",null,{"$f":"F148","v":0},"m3","Steypa",0,50,null,null,null,null,{"$f":"N148*EF_st_45","v":0},{"$f":"N148*mpV_steypa/1000*Q148*EF_fl_s+N148*mpV_steypa/1000*R148*EF_fl_i","v":0},null,0,null,0]
["84.57",null,"Vatnsvarnarlag undir malbik",null,null,0,"m2",null,"Annað","Vatnsvarnarlag","Brýr og steypt mannvirki","84.57 Vatnsvarnalag undir malbiki",null,{"$f":"F149*mpA_vatnsv","v":0},"kg","Vatnsvarnarlag",2000,50,null,null,null,null,{"$f":"N149*EF_vatnsv","v":0},{"$f":"N149/1000*Q149*EF_fl_s+N149/1000*R149*EF_fl_i","v":0},null,0,null,0]
["85.1",null,"Stálvirki, smíði"]
[null,null,"Stálvirki, smíði, óryðfrítt",null,null,0,"tonn",null,"Stál","Stál, brú","Brýr og steypt mannvirki","85.1 Stálvirki",null,{"$f":"F151","v":0},"tonn","Stál",2000,50,null,null,null,null,{"$f":"N151*1000*EF_St_bru","v":0},{"$f":"N151*Q151*EF_fl_s+N151*R151*EF_fl_i","v":0},null,0,null,0]
[null,null,"Stálvirki, smíði, ryðfrítt",null,null,0,"tonn",null,"Stál","Ryðfrítt stál, brú","Brýr og steypt mannvirki","85.1 Stálvirki",null,{"$f":"F152","v":0},"tonn","Ryðfrítt stál",2000,50,null,null,null,null,{"$f":"N152*1000*EF_St_bru_rf","v":0},{"$f":"N152*Q152*EF_fl_s+N152*R152*EF_fl_i","v":0},null,0,null,0]
["86.1",null,"Legur"]
[null,null,"Lóðrétt álag <300 tonn",null,null,0,"stk",null,"Gúmmí","Gúmmí, legur","Brýr og steypt mannvirki","86.1 Legur",null,{"$f":"F154*mpst_legur_S","v":0},"kg","Gúmmí",2000,50,null,null,null,null,{"$f":"N154*EF_gummi","v":0},{"$f":"N154/1000*Q154*EF_fl_s+N154/1000*R154*EF_fl_i","v":0},null,0,{"$f":"Z154*(_xlfn.CEILING.MATH(Forsíða!$D$8/ET_legur)-1)","v":0},0]
[null,null,"Lóðrétt álag >300 tonn",null,null,0,"stk",null,"Gúmmí","Gúmmí, legur","Brýr og steypt mannvirki","86.1 Legur",null,{"$f":"F155*mpst_legur_L","v":0},"kg","Gúmmí",2000,50,null,null,null,null,{"$f":"N155*EF_gummi","v":0},{"$f":"N155/1000*Q155*EF_fl_s+N155/1000*R155*EF_fl_i","v":0},null,0,{"$f":"Z155*(_xlfn.CEILING.MATH(Forsíða!$D$8/ET_legur)-1)","v":0},0]
["86.4",null,"Þensluraufar",null,null,0,"m",null,"Stál","Stál, þensluraufar","Brýr og steypt mannvirki","86.4 Þensluraufar",null,{"$f":"F156*mpL_stal_rauf","v":0},"kg","Stál",2000,50,null,null,null,null,{"$f":"N156*EF_St_bru","v":0},{"$f":"N156/1000*Q156*EF_fl_s+N156/1000*R156*EF_fl_i","v":0},null,{"$f":"SUM(W156:Y156)","v":0},{"$f":"Z156*(_xlfn.CEILING.MATH(Forsíða!$D$8/ET_thraufar)-1)","v":0},0]
[null,null,null,null,null,null,null,null,"Gúmmí","Gúmmí, þensluraufar","Brýr og steypt mannvirki","86.4 Þensluraufar",null,{"$f":"F156*mpL_gummi_rauf","v":0},"kg","Gúmmí",2000,50,null,null,null,null,{"$f":"N157*EF_gummi","v":0},{"$f":"N157/1000*Q157*EF_fl_s+N157/1000*R157*EF_fl_i","v":0},null,{"$f":"SUM(W157:Y157)","v":0},{"$f":"Z157*(_xlfn.CEILING.MATH(Forsíða!$D$8/ET_thraufar)-1)","v":0},0]
[null,null,null,null,null,null,null,null,null,null,null,null,null,null,null,null,"Heildarolíunotkun [L]",null,{"$f":"SUM(S132:S157)","v":0},"Brýr og steypt mannvirki samtals",null,null,{"$f":"SUM(W132:W157)","v":0},{"$f":"SUM(X132:X157)","v":196.8},0,196.8,0,{"$f":"SUM(AB132:AB157)","v":196.8}]
["Jarðgöng"]
["22.51",null,"Gröftur í göngum ",null,null,0,"m3"]
[null,null,"Sprenging/gröftur",null,null,{"$f":"F160","v":0},"m3",null,"Jarðvinna","Jarðvinna, gangnagerð","Jarðgöng","22.51 Gröftur í göngum",null,{"$f":"F161*mpV_spr_gong","v":0},"kg","Sprengiefni",1500,50,null,{"$f":"F161*EpV_gong","v":0},"kWh","Rafmagn",{"$f":"N161*EF_spr","v":0},{"$f":"N161/1000*Q161*EF_fl_s+N161/1000*R161*EF_fl_i","v":0},{"$f":"T161*EF_rafm","v":0},{"$f":"SUM(W161:Y161)","v":0},null,{"$f":"SUM(Z161:AA161)","v":0}]
[null,null,"Flutningur efnis frá vinnufleti að gangnamunna",null,null,{"$f":"F160","v":0},"m3",null,"Jarðvinna","Jarðvinna, gangnagerð","Jarðgöng","22.51 Gröftur í göngum",null,null,null,null,0,{"$f":"Forsíða!$D$16/2/1000","v":0},{"$f":"F162*(Oil_grafa)","v":0},null,null,null,null,{"$f":"F162*mpV_fb*R162*EF_fl_mi*2","v":0},{"$f":"S162*EF_oil","v":0},{"$f":"SUM(W162:Y162)","v":0},null,0]
[null,null,"Flutningur efnis frá gangnamunna",null,null,{"$f":"F161","v":0},"m3",null,"Jarðvinna","Jarðvinna, gangnagerð","Jarðgöng","22.51 Gröftur í göngum",null,null,null,null,0,100,{"$f":"F163*(Oil_grafa+Oil_gong)","v":0},null,null,null,null,{"$f":"F163*mpV_fb*R163*EF_fl_mi*2","v":0},{"$f":"S163*EF_oil","v":0},0,null,0]
["23.2",null,"Borun könnunar og bergþéttingampVla (samtals)",null,null,0,"m",null,"Jarðvinna","Jarðvinna, gangnagerð","Jarðgöng","23.2 Borun könnunar og bergþéttingampVla",null,null,null,null,null,null,{"$f":"F164*Oil_borun","v":0},null,null,null,null,null,{"$f":"S164*EF_oil","v":0},{"$f":"SUM(W164:Y164)","v":0},null,0]
["23.6",null,"Bergþétting með sementsefju",null,null,0,"kg",null,"Steypa","Steypa, bergþétting","Jarðgöng","23.6 Bergþétting með sementsefju",null,{"$f":"F165","v":0},"kg","Sement",1500,500,null,null,null,null,{"$f":"N165*EF_cem1","v":0},{"$f":"N165/1000*Q165*EF_fl_s+N165/1000*R165*EF_fl_i","v":0},null,{"$f":"SUM(W165:Y165)","v":0},null,0]
["25.2",null,"Bergboltar",null,null,0,"stk",null,"Stál","Kambstál, bergboltar","Jarðgöng","25.2 Bergboltar",null,{"$f":"F166*(0.9*mpst_bergb_4m+0.1*mpst_bergb_6m)","v":0},"kg","Bergboltar úr kambstáli",1500,50,null,null,null,null,{"$f":"N166*EF_bergb","v":0},{"$f":"N166/1000*Q166*EF_fl_s+N166/1000*R166*EF_fl_i","v":0},null,{"$f":"SUM(W166:Y166)","v":0},null,0]
["25.4",null,"Sprautusteypa (styrkingar og einangrun)",null,null,0,"m3",null,"Steypa","Steypa, sprautusteypa","Jarðgöng","25.4 Sprautusteypa",null,{"$f":"F167","v":0},"m3","Sprautusteypa með stáltrefjum",0,50,null,null,null,null,{"$f":"N167*EF_spr_st","v":0},{"$f":"N167*mpV_steypa/1000*Q167*EF_fl_s+N167*mpV_steypa/1000*R167*EF_fl_i","v":0},null,0,null,0]
["25.62",null,"Járnalögn (styrkingar og einangrun)",null,null,0,"kg",null,"Stál","Kambstál, járnalögn í göngum","Jarðgöng","25.62 Járnalögn",null,{"$f":"F168","v":0},"kg","kambstál",2000,50,null,null,null,null,{"$f":"N168*EF_kamb","v":0},{"$f":"N168/1000*Q168*EF_fl_s+N168/1000*R168*EF_fl_i","v":0},null,0,null,0]
["26.3",null,"Dúkur undir sprautusteypu",null,null,0,"m2",null,"Plast","Jarðgangadúkur","Jarðgöng","26.3 Dúkur undir sprautusteypu",null,{"$f":"F169*mpA_dukur","v":0},"kg","Plast, PE",1500,50,null,null,null,null,{"$f":"N169*EF_dukur","v":0},{"$f":"N169/1000*Q169*EF_fl_s+N169/1000*R169*EF_fl_i","v":0},{"$f":"N169*EF_dukur_a5","v":0},0,null,0]
["26.1",null,"Einangrunarklæðing undir sprautusteypu",null,null,0,"m2",null,"Plast","Einangrunarklæðning","Jarðgöng","26.1 Einangrunarklæðing undir sprautusteypu",null,{"$f":"F170*mpA_einangr","v":0},"kg","Plast, PE",1500,50,null,null,null,null,{"$f":"N170*EF_einangrun","v":0},{"$f":"N170/1000*Q170*EF_fl_s+N170/1000*R170*EF_fl_i","v":0},{"$f":"N170*EF_einangrun_a5","v":0},0,null,0]
[null,null,null,null,null,null,null,null,null,null,null,null,null,null,null,null,"Heildarolíunotkun [L]",null,{"$f":"SUM(S160:S170)","v":0},"Jarðgöng samtals",null,null,{"$f":"SUM(W160:W170)","v":0},0,0,0,0,0]
[]
[]
[null,null,null,null,null,null,null,null,null,null,null,null,null,null,null,"Heildarolíunotkun framkvæmdar",null,null,{"$f":"SUM(S171,S158,S130,S99,S85,S77,S14)","v":0},"Öll framkvæmd samtals",null,null,{"$f":"SUM(W171,W158,W130,W99,W85,W77,W14)","v":0},196.8,0,196.8,0,196.8]

{"sheet":"Innsláttur - Vegir","index":3,"n_rows":132,"n_cols":28,"rows_kept":132,"cut":false,"hidden":false,"merged":[[103,2,103,4],[104,2,105,4],[117,2,118,2],[125,3,126,3],[123,3,124,3],[121,3,122,3],[119,3,120,3],[117,3,118,3],[125,4,126,4],[123,4,124,4],[121,4,122,4],[119,4,120,4],[112,0,112,1],[113,0,113,1],[114,0,114,1],[115,0,115,1],[116,0,116,1],[98,0,98,1],[103,0,103,1],[110,0,110,1],[111,0,111,1],[63,5,65,5],[72,2,72,4],[73,2,73,4],[74,2,74,4],[75,2,75,4],[97,2,97,4],[87,2,87,4],[98,2,98,4],[91,2,91,4],[93,2,93,4],[81,2,81,4],[82,2,82,4],[83,2,83,4],[84,2,84,4],[85,2,85,4],[86,2,86,4],[60,5,62,5],[60,6,62,6],[60,12,62,12],[69,2,71,4],[66,2,68,4],[63,2,65,4],[69,6,71,6],[66,6,68,6],[1,0,2,1],[1,5,2,5],[1,6,2,6],[1,12,2,12],[1,2,2,4],[1,8,2,8],[13,0,13,1],[10,0,10,1],[11,2,11,4],[12,2,12,4],[13,2,13,4],[10,2,10,4],[25,2,25,4],[26,2,26,4],[27,2,27,4],[28,2,28,4],[127,0,127,1],[127,2,127,4],[7,0,7,1],[6,0,6,1],[5,0,5,1],[14,0,14,1],[18,0,18,1],[91,0,91,1],[92,0,92,1],[93,0,93,1],[97,0,97,1],[60,2,62,4],[29,2,29,4],[19,2,19,4],[20,2,20,4],[21,2,21,4],[22,2,22,4],[23,2,23,4],[24,2,24,4],[54,2,54,4],[55,2,55,4],[46,2,46,4],[47,2,47,4],[48,2,48,4],[128,2,128,4],[112,2,112,4],[113,2,113,4],[114,2,114,4],[116,2,116,4],[110,2,110,4],[108,5,109,5],[106,5,107,5],[104,5,105,5],[108,2,109,4],[111,2,111,4],[125,5,126,5],[123,5,124,5],[121,5,122,5],[119,5,120,5],[117,5,118,5],[117,4,118,4],[39,2,39,4],[40,2,40,4],[52,2,52,4],[53,2,53,4],[14,2,14,4],[18,2,18,4],[30,2,30,4],[31,2,31,4],[32,2,32,4],[33,2,33,4],[49,2,49,4],[50,2,50,4],[51,2,51,4],[38,2,38,4],[1,22,1,27],[1,19,1,21],[125,2,126,2],[123,2,124,2],[121,2,122,2],[119,2,120,2],[9,2,9,4],[8,2,8,4],[7,2,7,4],[6,2,6,4],[5,2,5,4],[34,2,34,4],[41,2,41,4],[42,2,42,4],[43,2,43,4],[44,2,44,4],[45,2,45,4],[35,2,35,4],[36,2,36,4],[37,2,37,4],[104,6,105,6],[106,2,107,4],[125,6,126,6],[123,6,124,6],[1,9,2,9],[1,10,2,10],[1,11,2,11],[136,18,136,21],[79,19,79,21],[87,19,87,21],[101,19,101,21],[129,19,129,21],[108,12,109,12],[106,12,107,12],[104,12,105,12],[1,17,2,17],[69,12,71,12],[66,12,68,12],[63,12,65,12],[1,15,2,15],[1,16,2,16],[15,0,15,1],[15,2,15,4],[4,0,4,27],[17,0,17,27],[102,0,102,27],[90,0,90,27],[80,0,80,27],[16,19,16,21],[131,15,131,17],[131,19,131,21],[108,6,109,6],[106,6,107,6],[121,6,122,6],[119,6,120,6],[117,6,118,6],[8,0,8,1],[9,0,9,1],[69,5,71,5],[66,5,68,5],[63,6,65,6],[56,2,56,4],[57,2,57,4],[58,2,58,4],[59,2,59,4]]}
[]
["Númer verkþáttar",null,"Heiti verkþáttar",null,null,"Magn","Eining",null,"Flokkur, gróft","Flokkur, ítarlegt","Yfirverkþáttur","Undirverkþáttur","Efni","Flutningsvegalengd [km]",null,"Magn","Eining","Efni","Olíunotkun [L]","Önnur efnisnotkun",null,null,"Losun (kg CO2-íg.)"]
[null,null,null,null,null,null,null,null,null,null,null,null,null,"Á sjó","Innanlands",null,null,null,"Magn","Magn","Eining","Skýring","A1-A3","A4","A5","A1-A5","B4","A1-A5 + B4"]
[]
["Skeringar og undirbygging"]
["32.1",null,"Bergskeringar í vegstæði",null,null,0,"m3 ",null,"Jarðvinna","Jarðvinna, bergskeringar","Skeringar og undirbygging","32.1 Bergskeringar í vegstæði","Fast berg",2800,20,{"$f":"F6*spr_fb","v":0},"kg","Sprengiefni",{"$f":"F6*Oil_bor","v":0},{"$f":"P6","v":0},"kg","Sprengiefni",{"$f":"P6*EF_spr","v":0},{"$f":"P6/1000*N6*EF_fl_s+P6/1000*O6*EF_fl_i","v":0},{"$f":"S6*EF_oil","v":0},{"$f":"SUM(W6:Y6)","v":0},null,{"$f":"SUM(Z6:AA6)","v":0}]
["32.2",null,"Bergskeringar í námu",null,null,0,"m3 ",null,"Jarðvinna","Jarðvinna, bergskeringar","Skeringar og undirbygging","32.2 Bergskeringar í námu","Fast berg",2800,20,{"$f":"F7*spr_fb","v":0},"kg","Sprengiefni",{"$f":"F7*Oil_bor","v":0},{"$f":"P7","v":0},"kg","Sprengiefni",{"$f":"P7*EF_spr","v":0},{"$f":"P7/1000*N7*EF_fl_s+P7/1000*O7*EF_fl_i","v":0},{"$f":"S7*EF_oil","v":0},{"$f":"SUM(W7:Y7)","v":0},null,{"$f":"SUM(Z7:AA7)","v":0}]
["33.1",null,"Fyllingarefni úr skeringum",null,null,null,null,null,null,null,null,null,null,null,null,null,null,null,null,null,null,null,null,null,null,null,null,0]
[null,null,"Þar af laust fyllingarefni",null,null,0,"m3 ",null,"Jarðvinna","Jarðvinna, fyllingarefni","Skeringar og undirbygging","33.1 Fyllingarefni úr skeringum","Þjappað fyllingarefni",0,0,null,null,null,{"$f":"F9*(Oil_veg+Oil_grafa+Oil_yta+Oil_valt)","v":0},null,null,null,null,{"$f":"F9*mpV_fb/CF_þ_f*N9*EF_fl_s+F9*mpV_fb/CF_þ_f*O9*EF_fl_mi","v":0},{"$f":"S9*EF_oil","v":0},0,null,0]
[null,null,"Þar af sprengt fyllingarefni",null,null,0,"m3",null,"Jarðvinna","Jarðvinna, fyllingarefni","Skeringar og undirbygging","33.1 Fyllingarefni úr skeringum","Þjappað fyllingarefni",0,0,null,null,null,{"$f":"F10*(Oil_grafa*2+Oil_yta+Oil_valt)","v":0},null,null,null,null,{"$f":"F10*mpV_fb/CF_þ_f*N10*EF_fl_s+F10*mpV_fb/CF_þ_f*O10*EF_fl_mi","v":0},{"$f":"S10*EF_oil","v":0},0,null,0]
["33.2",null,"Fyllingarefni úr námu",null,null,null,null,null,null,null,null,null,null,null,null,null,null,null,null,null,null,null,null,null,null,null,null,0]
[null,null,"Þar af laust fyllingarefni",null,null,0,"m3",null,"Jarðvinna","Jarðvinna, fyllingarefni","Skeringar og undirbygging","33.2 Fyllingarefni úr námu","Þjappað fyllingarefni",0,20,null,null,null,{"$f":"F12*(Oil_grafa*2+Oil_yta+Oil_valt)","v":0},null,null,null,null,{"$f":"F12*mpV_fb/CF_þ_f*N12*EF_fl_s+F12*mpV_fb/CF_þ_f*O12*EF_fl_mi","v":0},{"$f":"S12*EF_oil","v":0},0,null,0]
[null,null,"Sprengt fyllingarefni",null,null,0,"m3",null,"Jarðvinna","Jarðvinna, fyllingarefni","Skeringar og undirbygging","33.2 Fyllingarefni úr námu","Þjappað fyllingarefni",0,20,null,null,null,{"$f":"F13*(Oil_grafa*2+Oil_yta+Oil_valt)","v":0},null,null,null,null,{"$f":"F13*mpV_fb/CF_þ_f*N13*EF_fl_s+F13*mpV_fb/CF_þ_f*O13*EF_fl_mi","v":0},{"$f":"S13*EF_oil","v":0},0,null,0]
["34.1",null,"Fláafleygar, efni úr skeringum",null,null,0,"m3",null,"Jarðvinna","Jarðvinna, fláafleygar","Skeringar og undirbygging","34.1 Fláafleygar, efni úr skeringum",null,0,20,null,null,null,{"$f":"F14*(Oil_veg+Oil_grafa+Oil_yta)","v":0},null,null,null,null,{"$f":"F14*mpV_fb/CF_l_f*N14*EF_fl_s+F14*mpV_fb/CF_l_f*O14*EF_fl_mi","v":0},{"$f":"S14*EF_oil","v":0},0,null,0]
["34.8",null,"Ónothæfu efni jafnað á losunarstað",null,null,0,"m3",null,"Jarðvinna","Jarðvinna, ónothæft efni","Skeringar og undirbygging","34.8 Ónothæfu efni jafnað á losunarstað",null,0,20,null,null,null,{"$f":"F15*(Oil_veg+Oil_yta)","v":0},null,null,null,null,{"$f":"F15*mpV_fb/CF_l_f*N15*EF_fl_s+F15*mpV_fb/CF_l_f*O15*EF_fl_mi","v":0},{"$f":"S15*EF_oil","v":0},0,null,0]
["36.2",null,"Grjótvörn",null,null,0,"m3",null,"Jarðvinna","Jarðvinna, grjótvörn","Skeringar og undirbygging","36.2 Grjótvörn",null,0,20,{"$f":"F16","v":0},"m3","grjót 0,5-2 tonn",{"$f":"F16*Oil_grjot","v":0},null,null,null,{"$f":"P16*EF_grjot","v":0},{"$f":"F16*mpV_grjot*N16*EF_fl_s+F16*mpV_grjot*O16*EF_fl_mi","v":0},{"$f":"S16*EF_oil","v":0},0,null,0]
[null,null,null,null,null,null,null,null,null,null,null,null,null,null,null,null,null,"Heildarolíunotkun [L]",{"$f":"SUM(S6:S16)","v":0},"Skeringar og undirbygging samtals",null,null,{"$f":"SUM(W6:W16)","v":0},0,0,0,0,{"$f":"SUM(AB6:AB16)","v":0}]
["Ræsi og veitur"]
["45.71",null,"Plaströr, vatnsveita"]
[null,null,"Vatnsveiturör, D = 63 - 200 mm",null,null,0,"m",null,"Plast","Plast, Vatnsveiturör","Ræsi og veitur","45.71 Plaströr, vatnsveita","Plaströr",2800,20,{"$f":"F20*mpl_VVror_02","v":0},"kg","Plast, PE",null,null,null,null,{"$f":"P20*EF_VV_PE","v":0},{"$f":"P20/1000*N20*EF_fl_s+P20/1000*O20*EF_fl_i","v":0},null,{"$f":"SUM(W20:Y20)","v":0},null,{"$f":"SUM(Z20:AA20)","v":0}]
[null,null,"Vatnsveiturör, D = 201 - 400  mm",null,null,0,"m",null,"Plast","Plast, Vatnsveiturör","Ræsi og veitur","45.71 Plaströr, vatnsveita","Plaströr",2800,20,{"$f":"F21*mpl_VVror_04","v":0},"kg","Plast, PE",null,null,null,null,0,0,null,0,null,0]
[null,null,"Vatnsveiturör, D = 401 - 600  mm",null,null,0,"m",null,"Plast","Plast, Vatnsveiturör","Ræsi og veitur","45.71 Plaströr, vatnsveita","Plaströr",2800,20,{"$f":"F22*mpl_VVror_06","v":0},"kg","Plast, PE",null,null,null,null,0,0,null,0,null,0]
[null,null,"Vatnsveiturör, D = 601 - 800  mm",null,null,0,"m",null,"Plast","Plast, Vatnsveiturör","Ræsi og veitur","45.71 Plaströr, vatnsveita","Plaströr",2800,20,{"$f":"F23*mpl_VVror_08","v":0},"kg","Plast, PE",null,null,null,null,0,0,null,0,null,0]
[null,null,"Vatnsveiturör, D = 801 - 1000  mm",null,null,0,"m",null,"Plast","Plast, Vatnsveiturör","Ræsi og veitur","45.71 Plaströr, vatnsveita","Plaströr",2800,20,{"$f":"F24*mpl_VVror_10","v":0},"kg","Plast, PE",null,null,null,null,0,0,null,0,null,0]
[null,null,"Vatnsveiturör, D = 1001 - 1200  mm",null,null,0,"m",null,"Plast","Plast, Vatnsveiturör","Ræsi og veitur","45.71 Plaströr, vatnsveita","Plaströr",2800,20,{"$f":"F25*mpl_VVror_12","v":0},"kg","Plast, PE",null,null,null,null,0,0,null,0,null,0]
["42.3",null,"Plaströr, fráveita"]
[null,null,"Fráveiturör, D = 250 - 400 mm",null,null,0,"m",null,"Plast","Plast, fráveiturör","Ræsi og veitur","42.3 Plaströr, fráveita","Plaströr",2800,20,{"$f":"F27*mpl_FVror_04","v":0},"kg","Plast, X-Stream",null,null,null,null,{"$f":"P27*EF_FV_Xstr","v":0},{"$f":"P27/1000*N27*EF_fl_s+P27/1000*O27*EF_fl_i","v":0},null,{"$f":"SUM(W27:Y27)","v":0},null,0]
[null,null,"Fráveiturör, D = 401 - 600 mm",null,null,0,"m",null,"Plast","Plast, fráveiturör","Ræsi og veitur","42.3 Plaströr, fráveita","Plaströr",2800,20,{"$f":"F28*mpl_FVror_06","v":0},"kg","Plast, X-Stream",null,null,null,null,{"$f":"P28*EF_FV_Xstr","v":0},0,null,0,null,0]
[null,null,"Fráveiturör, D = 601 - 800 mm",null,null,0,"m",null,"Plast","Plast, fráveiturör","Ræsi og veitur","42.3 Plaströr, fráveita","Plaströr",2800,20,{"$f":"F29*mpl_FVror_08","v":0},"kg","Plast, X-Stream",null,null,null,null,{"$f":"P29*EF_FV_Xstr","v":0},0,null,0,null,0]
[null,null,"Fráveiturör, D = 801 - 1000 mm",null,null,0,"m",null,"Plast","Plast, fráveiturör","Ræsi og veitur","42.3 Plaströr, fráveita","Plaströr",2800,20,{"$f":"F30*mpl_FVror_10","v":0},"kg","Plast, Weholite",null,null,null,null,{"$f":"P30*EF_FV_Weh","v":0},0,null,0,null,0]
[null,null,"Fráveiturör, D = 1001 - 1400 mm",null,null,0,"m",null,"Plast","Plast, fráveiturör","Ræsi og veitur","42.3 Plaströr, fráveita","Plaströr",2800,20,{"$f":"F31*mpl_FVror_14","v":0},"kg","Plast, Weholite",null,null,null,null,{"$f":"P31*EF_FV_Weh","v":0},0,null,0,null,0]
[null,null,"Fráveiturör, D = 1401 - 1800 mm",null,null,0,"m",null,"Plast","Plast, fráveiturör","Ræsi og veitur","42.3 Plaströr, fráveita","Plaströr",2800,20,{"$f":"F32*mpl_FVror_18","v":0},"kg","Plast, Weholite",null,null,null,null,{"$f":"P32*EF_FV_Weh","v":0},0,null,0,null,0]
[null,null,"Fráveiturör, D = 1801 - 2200 mm",null,null,0,"m",null,"Plast","Plast, fráveiturör","Ræsi og veitur","42.3 Plaströr, fráveita","Plaströr",2800,20,{"$f":"F33*mpl_FVror_22","v":0},"kg","Plast, Weholite",null,null,null,null,{"$f":"P33*EF_FV_Weh","v":0},0,null,0,null,0]
[null,null,"Fráveiturör, D > 2200 mm",null,null,0,"m",null,"Plast","Plast, fráveiturör","Ræsi og veitur","42.3 Plaströr, fráveita","Plaströr",2800,20,{"$f":"F34*mpl_FVror_22p","v":0},"kg","Plast, Weholite",null,null,null,null,{"$f":"P34*EF_FV_Weh","v":0},0,null,0,null,0]
["45.72",null,"Hitaveiturör"]
[null,null,"Hitaveiturör, D = 250 mm",null,null,0,"m",null,"Stál","Stál, hitaveiturör","Ræsi og veitur","45.72 Hitaveiturör","PUR-einangrað stálrör",2800,20,{"$f":"F36","v":0},"m","Einangrað stálrör",null,null,null,null,{"$f":"P36*EF_Hvror_025","v":0},{"$f":"P36/1000*N36*EF_fl_s+P36/1000*O36*EF_fl_i","v":0},null,{"$f":"SUM(W36:Y36)","v":0},null,0]
[null,null,"Hitaveiturör, D = 300 mm",null,null,0,"m",null,"Stál","Stál, hitaveiturör","Ræsi og veitur","45.72 Hitaveiturör","PUR-einangrað stálrör",2800,20,0,"m","Einangrað stálrör",null,null,null,null,{"$f":"P37*EF_Hvror_03","v":0},0,null,0,null,0]
[null,null,"Hitaveiturör, D = 350 mm",null,null,0,"m",null,"Stál","Stál, hitaveiturör","Ræsi og veitur","45.72 Hitaveiturör","PUR-einangrað stálrör",2800,20,0,"m","Einangrað stálrör",null,null,null,null,{"$f":"P38*EF_Hvror_035","v":0},0,null,0,null,0]
[null,null,"Hitaveiturör, D = 400 mm",null,null,0,"m",null,"Stál","Stál, hitaveiturör","Ræsi og veitur","45.72 Hitaveiturör","PUR-einangrað stálrör",2800,20,0,"m","Einangrað stálrör",null,null,null,null,{"$f":"P39*EF_Hvror_04","v":0},0,null,0,null,0]
[null,null,"Hitaveiturör, D = 450 mm",null,null,0,"m",null,"Stál","Stál, hitaveiturör","Ræsi og veitur","45.72 Hitaveiturör","PUR-einangrað stálrör",2800,20,0,"m","Einangrað stálrör",null,null,null,null,{"$f":"P40*EF_Hvror_045","v":0},0,null,0,null,0]
[null,null,"Hitaveiturör, D = 500 mm",null,null,0,"m",null,"Stál","Stál, hitaveiturör","Ræsi og veitur","45.72 Hitaveiturör","PUR-einangrað stálrör",2800,20,0,"m","Einangrað stálrör",null,null,null,null,{"$f":"P41*EF_Hvror_05","v":0},0,null,0,null,0]
[null,null,"Hitaveiturör, D = 600 mm",null,null,0,"m",null,"Stál","Stál, hitaveiturör","Ræsi og veitur","45.72 Hitaveiturör","PUR-einangrað stálrör",2800,20,0,"m","Einangrað stálrör",null,null,null,null,{"$f":"P42*EF_Hvror_06","v":0},0,null,0,null,0]
[null,null,"Hitaveiturör, D = 700 mm",null,null,0,"m",null,"Stál","Stál, hitaveiturör","Ræsi og veitur","45.72 Hitaveiturör","PUR-einangrað stálrör",2800,20,0,"m","Einangrað stálrör",null,null,null,null,{"$f":"P43*EF_Hvror_07","v":0},0,null,0,null,0]
[null,null,"Hitaveiturör, D = 800 mm",null,null,0,"m",null,"Stál","Stál, hitaveiturör","Ræsi og veitur","45.72 Hitaveiturör","PUR-einangrað stálrör",2800,20,0,"m","Einangrað stálrör",null,null,null,null,{"$f":"P44*EF_Hvror_08","v":0},0,null,0,null,0]
["42.4",null,"Stálrör í ræsi"]
[null,42412,"Stálrör, D = 0,3 m",null,null,0,"m",null,"Stál","Stál, ræsi","Ræsi og veitur","42.4 Stálrör í ræsi","Stálrör",2800,20,{"$f":"F46*mpl_Stalror_03","v":0},"kg","Stál",null,null,null,null,{"$f":"P46*EF_Stal_ror","v":0},{"$f":"P46/1000*N46*EF_fl_s+P46/1000*O46*EF_fl_i","v":0},null,{"$f":"SUM(W46:Y46)","v":0},null,0]
[null,42415,"Stálrör, D = 0,6 m",null,null,0,"m",null,"Stál","Stál, ræsi","Ræsi og veitur","42.4 Stálrör í ræsi","Stálrör",2800,20,{"$f":"F47*mpl_Stalror_06","v":0},"kg","Stál",null,null,null,null,0,0,null,0,null,0]
[null,42417,"Stálrör, D = 0,8 m",null,null,0,"m",null,"Stál","Stál, ræsi","Ræsi og veitur","42.4 Stálrör í ræsi","Stálrör",2800,20,{"$f":"F48*mpl_Stalror_08","v":0},"kg","Stál",null,null,null,null,0,0,null,0,null,0]
[null,42422,"Stálrör, D = 1,0 m",null,null,0,"m",null,"Stál","Stál, ræsi","Ræsi og veitur","42.4 Stálrör í ræsi","Stálrör",2800,20,{"$f":"F49*mpl_Stalror_10","v":0},"kg","Stál",null,null,null,null,0,0,null,0,null,0]
[null,42424,"Stálrör, D = 1,2 m",null,null,0,"m",null,"Stál","Stál, ræsi","Ræsi og veitur","42.4 Stálrör í ræsi","Stálrör",2800,20,{"$f":"F50*mpl_Stalror_12","v":0},"kg","Stál",null,null,null,null,0,0,null,0,null,0]
[null,42428,"Stálrör, D = 1,6 m",null,null,0,"m",null,"Stál","Stál, ræsi","Ræsi og veitur","42.4 Stálrör í ræsi","Stálrör",2800,20,{"$f":"F51*mpl_Stalror_16","v":0},"kg","Stál",null,null,null,null,0,0,null,0,null,0]
[null,42432,"Stálrör, D = 2,0 m",null,null,0,"m",null,"Stál","Stál, ræsi","Ræsi og veitur","42.4 Stálrör í ræsi","Stálrör",2800,20,{"$f":"F52*mpl_Stalror_20","v":0},"kg","Stál",null,null,null,null,0,0,null,0,null,0]
[null,42442,"Stálrör, D >= 3,0 m",null,null,0,"m",null,"Stál","Stál, ræsi","Ræsi og veitur","42.4 Stálrör í ræsi","Stálrör",2800,20,{"$f":"F53*mpl_Stalror_30","v":0},"kg","Stál",null,null,null,null,0,0,null,0,null,0]
["45.4",null,"Steypt ofanvatnsræsi"]
[null,"45.41","Steypt ofanvatnsræsi, D < 120 mm",null,null,0,"m",null,"Steypa","Steypa, ofanvatnsræsi","Ræsi og veitur","45.4 Steypt ofanvatnsræsi","Steypt rör",2800,20,{"$f":"F55*mpl_Stror_120","v":0},"kg","Steypt rör",null,null,null,null,{"$f":"P55/mpV_steypa*EF_St_ror","v":0},{"$f":"P55/1000*N55*EF_fl_s+P55/1000*O55*EF_fl_i","v":0},null,{"$f":"SUM(W55:Y55)","v":0},null,0]
[null,"45.42","Steypt ofanvatnsræsi, D = 120 - 300 mm",null,null,0,"m",null,"Steypa","Steypa, ofanvatnsræsi","Ræsi og veitur","45.4 Steypt ofanvatnsræsi","Steypt rör",2800,20,{"$f":"F56*mpl_Stror_300","v":0},"kg","Steypt rör",null,null,null,null,{"$f":"P56/mpV_steypa*EF_St_ror","v":0},{"$f":"P56/1000*N56*EF_fl_s+P56/1000*O56*EF_fl_i","v":0},null,0,null,0]
[null,"45.43","Steypt ofanvatnsræsi, D = 301 - 600 mm",null,null,0,"m",null,"Steypa","Steypa, ofanvatnsræsi","Ræsi og veitur","45.4 Steypt ofanvatnsræsi","Steypt rör",2800,20,{"$f":"F57*mpl_Stror_600","v":0},"kg","Steypt rör",null,null,null,null,{"$f":"P57/mpV_steypa*EF_St_ror","v":0},{"$f":"P57/1000*N57*EF_fl_s+P57/1000*O57*EF_fl_i","v":0},null,0,null,0]
[null,"45.44","Steypt ofanvatnsræsi, D = 601 - 1000 mm",null,null,0,"m",null,"Steypa","Steypa, ofanvatnsræsi","Ræsi og veitur","45.4 Steypt ofanvatnsræsi","Steypt rör",2800,20,{"$f":"F58*mpl_Stror_1000","v":0},"kg","Steypt rör",null,null,null,null,{"$f":"P58/mpV_steypa*EF_St_ror","v":0},{"$f":"P58/1000*N58*EF_fl_s+P58/1000*O58*EF_fl_i","v":0},null,0,null,0]
[null,"45.45","Steypt ofanvatnsræsi, D > 1000 mm",null,null,0,"m",null,"Steypa","Steypa, ofanvatnsræsi","Ræsi og veitur","45.4 Steypt ofanvatnsræsi","Steypt rör",2800,20,{"$f":"F59*mpl_Stror_1000p","v":0},"kg","Steypt rör",null,null,null,null,{"$f":"P59/mpV_steypa*EF_St_ror","v":0},{"$f":"P59/1000*N59*EF_fl_s+P59/1000*O59*EF_fl_i","v":0},null,0,null,0]
["45.5",null,"Brunnar (plastbrunnar með steyptum flotkarmi og stálloki)"]
[null,null,"Brunnur, D = 600 mm, dýpt = 0-2,5 m",null,null,0,"stk",null,"Plast","Plast, brunnur","Ræsi og veitur","45.5 Brunnar","PP brunnur",2800,20,{"$f":"F61*(mpst_Br_06+mpl_BrUp_06*1)","v":0},"kg","Plast, PP",null,null,null,null,{"$f":"P61*EF_PP","v":0},{"$f":"P61/1000*N61*EF_fl_s+P61/1000*O61*EF_fl_i","v":0},null,0,null,{"$f":"SUM(Z61:AA61)","v":0}]
[null,null,null,null,null,null,null,null,"Steypa","Steypa, flotkarmur","Ræsi og veitur","45.5 Brunnar",null,2800,20,{"$f":"F61*mpst_flotk","v":0},"kg","Steyptur flotkarmur",null,null,null,null,{"$f":"P62/mpV_steypa*EF_St_ror","v":0},0,null,0,null,{"$f":"SUM(Z62:AA62)","v":0}]
[null,null,null,null,null,null,null,null,"Stál","Stál, brunnlok","Ræsi og veitur","45.5 Brunnar",null,2800,20,{"$f":"F61*mpst_br_lok","v":0},"kg","Stállok",null,null,null,null,{"$f":"P63*EF_Stal_ror","v":0},0,null,0,null,0]
[null,null,"Brunnur, D = 600 mm, dýpt > 2,5 m",null,null,0,"stk",null,"Plast","Plast, brunnur","Ræsi og veitur","45.5 Brunnar","PP brunnur",2800,20,{"$f":"F64*(mpst_Br_06+mpl_BrUp_06*3)","v":0},"kg","Plast, PP",null,null,null,null,{"$f":"P64*EF_PP","v":0},0,null,0,null,0]
[null,null,null,null,null,null,null,null,"Steypa","Steypa, flotkarmur","Ræsi og veitur","45.5 Brunnar",null,2800,20,{"$f":"F64*mpst_flotk","v":0},"kg","Steyptur flotkarmur",null,null,null,null,{"$f":"P65*EF_St_ror","v":0},0,null,0,null,0]
[null,null,null,null,null,null,null,null,"Stál","Stál, brunnlok","Ræsi og veitur","45.5 Brunnar",null,2800,20,{"$f":"F64*mpst_br_lok","v":0},"kg","Stállok",null,null,null,null,{"$f":"P66*EF_Stal_ror","v":0},0,null,0,null,0]
[null,null,"Brunnur, D = 1000 mm, dýpt = 0-2,5 m",null,null,0,"stk",null,"Plast","Plast, brunnur","Ræsi og veitur","45.5 Brunnar","PP brunnur",2800,20,{"$f":"F67*(mpst_Br_10+mpl_BrUp_10*1)","v":0},"kg","Plast, PP",null,null,null,null,{"$f":"P67*EF_PP","v":0},0,null,0,null,0]
[null,null,null,null,null,null,null,null,"Steypa","Steypa, flotkarmur","Ræsi og veitur","45.5 Brunnar",null,2800,20,{"$f":"F67*mpst_flotk","v":0},"kg","Steyptur flotkarmur",null,null,null,null,{"$f":"P68*EF_St_ror","v":0},0,null,0,null,0]
[null,null,null,null,null,null,null,null,"Stál","Stál, brunnlok","Ræsi og veitur","45.5 Brunnar",null,2800,20,{"$f":"F67*mpst_br_lok","v":0},"kg","Stállok",null,null,null,null,{"$f":"P69*EF_Stal_ror","v":0},0,null,0,null,0]
[null,null,"Brunnur, D = 1000 mm, dýpt > 2,5 m",null,null,0,"stk",null,"Plast","Plast, brunnur","Ræsi og veitur","45.5 Brunnar","PP brunnur",2800,20,{"$f":"F70*(mpst_Br_10+mpl_BrUp_10*3)","v":0},"kg","Plast, PP",null,null,null,null,{"$f":"P70*EF_PP","v":0},0,null,0,null,0]
[null,null,null,null,null,null,null,null,"Steypa","Steypa, flotkarmur","Ræsi og veitur","45.5 Brunnar",null,2800,20,{"$f":"F70*mpst_flotk","v":0},"kg","Steyptur flotkarmur",null,null,null,null,{"$f":"P71*EF_St_ror","v":0},0,null,0,null,0]
[null,null,null,null,null,null,null,null,"Stál","Stál, brunnlok","Ræsi og veitur","45.5 Brunnar",null,2800,20,{"$f":"F70*mpst_br_lok","v":0},"kg","Stállok",null,null,null,null,{"$f":"P72*EF_Stal_ror","v":0},0,null,0,null,0]
["45.6",null,"Niðurföll / sandfang",null,null,0,"stk",null,"Plast","Plast, niðurfall","Ræsi og veitur","45.6 Niðurföll / sandfang","PP niðurfall",2800,20,{"$f":"F73*mpst_nfall","v":0},"kg","Plast, PP",null,null,null,null,{"$f":"P73*EF_PP","v":0},0,null,0,null,0]
["45.68",null,"Grjótsvelgur",null,null,0,"m3",null,"Plast","Plast, Grjótsvelgur","Ræsi og veitur","45.68 Grjótsvelgur","Grjót",0,20,{"$f":"F74","v":0},"m3","grjót",{"$f":"F74*Oil_grjot","v":0},null,null,null,{"$f":"P74*EF_grjot","v":0},{"$f":"F74*mpV_grjot*N74*EF_fl_s+F74*mpV_grjot*O74*EF_fl_mi","v":0},{"$f":"S74*EF_oil","v":0},{"$f":"SUM(W74:Y74)","v":0},null,{"$f":"SUM(Z74:AA74)","v":0}]
["45.1 + 45.8",null,"Gröftur lagnaskurða og fylling í skurði",null,null,0,"m3",null,"Jarðvinna","Jarðvinna, lagnaskurðir","Ræsi og veitur","45.1 + 45.8 Gröftur lagnaskurða og fylling í skurði","Þjappað fyllingarefni",0,1,null,null,null,{"$f":"F75*(Oil_grafa+Oil_grafa+Oil_yta)","v":0},null,null,null,null,{"$f":"F75*mpV_fb/CF_þ_f*N75*EF_fl_s+F75*mpV_fb/CF_þ_f*O75*EF_fl_mi","v":0},{"$f":"S75*EF_oil","v":0},0,null,0]
[null,null,"Rafstrengir og ljósleiðari"]
[null,null,"Ljósleiðari",null,null,0,"m",null,"Rafstrengur","Rafstrengur","Ræsi og veitur","Rafstrengir","Ljósleiðari",2800,20,{"$f":"F77","v":0},"m","Ljósleiðari",null,null,null,null,{"$f":"P77*EF_ljosleid","v":0},{"$f":"P77*mpL_rafstr_1kv/1000*N77*EF_fl_s+P77*mpL_rafstr_1kv/1000*O77*EF_fl_i","v":0},null,{"$f":"SUM(W77:Y77)","v":0},null,0]
[null,null,"Rafstrengur, lágspenna (< 11 kV)",null,null,0,"m",null,"Rafstrengur","Rafstrengur","Ræsi og veitur","Rafstrengir","Rafstrengur, 1 kV",2800,20,{"$f":"F78","v":0},"m","Rafstrengur, 1 kV",null,null,null,null,{"$f":"P78*EF_strengur_1kv","v":0},{"$f":"P78*mpL_rafstr_1kv/1000*N78*EF_fl_s+P78*mpL_rafstr_1kv/1000*O78*EF_fl_i","v":0},null,{"$f":"SUM(W78:Y78)","v":0},null,0]
[null,null,"Rafstrengur, háspenna (≥ 11 kV)",null,null,0,"m",null,"Rafstrengur","Rafstrengur","Ræsi og veitur","Rafstrengir","Rafstrengur, 24 kV",2800,20,{"$f":"F79","v":0},"m","Rafstrengur, 24 kV",null,null,null,null,{"$f":"P79*EF_strengur_24kv","v":0},{"$f":"P79*mpL_rafstr_24kv/1000*N79*EF_fl_s+P79*mpL_rafstr_24kv/1000*O79*EF_fl_i","v":0},null,0,null,0]
[null,null,null,null,null,null,null,null,null,null,null,null,null,null,null,null,null,"Heildarolíunotkun [L]",{"$f":"SUM(S19:S79)","v":0},"Ræsi og veitur samtals",null,null,{"$f":"SUM(W19:W79)","v":0},{"$f":"SUM(X19:X79)","v":0},0,0,0,0]
["Styrktar- og burðarlög"]
["52.2",null,"Styrktarlag, unnið efni"]
[null,null,"Styrktarlag undir stíga",null,null,0,"m3",null,"Jarðvinna","Jarðvinna, styrktarlag","Styrktar- og burðarlög","52.2 Styrktarlag","Þjappað styrktarlagsefni",0,20,null,null,null,{"$f":"F83*(Oil_vin+Oil_grafa+Oil_yta+Oil_valt)","v":0},null,null,null,null,{"$f":"F83*mpV_fb/CF_þ_f*N83*EF_fl_s+F83*mpV_fb/CF_þ_f*O83*EF_fl_mi","v":0},{"$f":"S83*EF_oil","v":0},{"$f":"SUM(W83:Y83)","v":0},null,{"$f":"SUM(Z83:AA83)","v":0}]
[null,null,"Styrktarlag undir vegi",null,null,0,"m3",null,"Jarðvinna","Jarðvinna, styrktarlag","Styrktar- og burðarlög","52.2 Styrktarlag","Þjappað styrktarlagsefni",0,20,null,null,null,{"$f":"F84*(Oil_vin+Oil_grafa+Oil_yta+Oil_valt)","v":0},null,null,null,null,{"$f":"F84*mpV_fb/CF_þ_f*N84*EF_fl_s+F84*mpV_fb/CF_þ_f*O84*EF_fl_mi","v":0},{"$f":"S84*EF_oil","v":0},{"$f":"SUM(W84:Y84)","v":0},null,{"$f":"SUM(Z84:AA84)","v":0}]
[null,null,"Styrktarlag undir hellur",null,null,0,"m3",null,"Jarðvinna","Jarðvinna, styrktarlag","Styrktar- og burðarlög","52.2 Styrktarlag","Þjappað styrktarlagsefni",0,20,null,null,null,{"$f":"F85*(Oil_vin+Oil_grafa+Oil_yta+Oil_valt)","v":0},null,null,null,null,{"$f":"F85*mpV_fb/CF_þ_f*N85*EF_fl_s+F85*mpV_fb/CF_þ_f*O85*EF_fl_mi","v":0},{"$f":"S85*EF_oil","v":0},{"$f":"SUM(W85:Y85)","v":0},null,0]
[null,null,"Styrktarlag undir gangstéttir",null,null,0,"m3",null,"Jarðvinna","Jarðvinna, styrktarlag","Styrktar- og burðarlög","52.2 Styrktarlag","Þjappað styrktarlagsefni",0,20,null,null,null,{"$f":"F86*(Oil_vin+Oil_grafa+Oil_yta+Oil_valt)","v":0},null,null,null,null,{"$f":"F86*mpV_fb/CF_þ_f*N86*EF_fl_s+F86*mpV_fb/CF_þ_f*O86*EF_fl_mi","v":0},{"$f":"S86*EF_oil","v":0},{"$f":"SUM(W86:Y86)","v":0},null,0]
["53.1",null,"Óbundið burðarlag",null,null,0,"m3",null,"Jarðvinna","Jarðvinna, burðarlag","Styrktar- og burðarlög","53.1 Óbundið burðarlag","Þjappað burðarlagsefni",0,20,null,null,null,{"$f":"F87*(Oil_vinm+Oil_grafa+Oil_yta+Oil_valt)","v":0},null,null,null,null,{"$f":"F87*mpV_fb/CF_þ_f*N87*EF_fl_s+F87*mpV_fb/CF_þ_f*O87*EF_fl_mi","v":0},{"$f":"S87*EF_oil","v":0},{"$f":"SUM(W87:Y87)","v":0},{"$f":"Z87*(_xlfn.CEILING.MATH(Forsíða!$D$8/ET_bur_ob)-1)","v":0},0]
[null,null,null,null,null,null,null,null,null,null,null,null,null,null,null,null,null,"Heildarolíunotkun [L]",{"$f":"SUM(S82:S87)","v":0},"Styrktar og burðarlög samtals",null,null,{"$f":"SUM(W82:W87)","v":0},{"$f":"SUM(X82:X87)","v":0},0,0,0,{"$f":"SUM(AB82:AB87)","v":0}]
["53.4",null,"Bikbundið burðarlag",null,null,"Geyma"]
["53.5",null,"Sementsbundið burðarlag",null,null,"Geyma"]
["Slitlög"]
["62.1",null,"Klæðing, nýlögn",null,null,0,"m2",null,"Klæðing","Klæðing","Slitlög","62.1 Klæðing, nýlögn","Tvöföld klæðing",0,20,{"$f":"F92*mpA_klaeding","v":0},"kg","Klæðingarefni",{"$f":"F92*oil_klaed","v":0},null,null,null,{"$f":"F92*EF_klaed","v":0},null,{"$f":"S92*EF_oil","v":0},{"$f":"SUM(W92:Y92)","v":0},{"$f":"Z92*(_xlfn.CEILING.MATH(Forsíða!$D$8/ET_klaeding)-1-_xlfn.CEILING.MATH(Forsíða!$D$8/ET_bur_ob))*0.5+Z92*(_xlfn.CEILING.MATH(Forsíða!$D$8/ET_bur_ob)-1)","v":0},{"$f":"SUM(Z92:AA92)","v":0}]
["63.42",null,"Burðarlagsmalbik","Veldu þykkt","mm",0,"m2",null,"Malbik","Malbik, burðarlag","Slitlög","63.42 Burðarlagsmalbik","Burðarlagsmalbik",0,20,{"$f":"IFERROR(IF(F93=0,0,F93*D93/1000*mpV_malb),\"Veldu þykkt\")","v":0},"kg","Burðarlagsmalbik",{"$f":"F93*d_malb*mpV_malb*oil_malb","v":0},null,null,null,{"$f":"P93*EF_malb_bur","v":0},{"$f":"P93/1000*N93*EF_fl_s+P93/1000*O93*EF_fl_i","v":0},{"$f":"S93*EF_oil","v":0},0,{"$f":"Z93*(_xlfn.CEILING.MATH(Forsíða!$D$8/ET_malb_bur)-1)","v":0},0]
["63.43",null,"Slitlagsmalbik",null,null,null,null,null,null,null,null,null,null,null,null,null,null,null,null,null,null,null,null,null,null,null,null,0]
[null,null,"Slitlagsmalbik, ÁDU > 15000 ","Veldu þykkt","mm",0,"m2",null,"Malbik","Malbik, slitlag","Slitlög","63.43 Slitlagsmalbik","Slitlagsmalbik",0,20,{"$f":"IFERROR(IF(F95=0,0,F95*D95/1000*mpV_malb),\"Veldu þykkt\")","v":0},"kg","Slitlagsmalbik",{"$f":"F95*d_malb*mpV_malb*oil_malb","v":0},null,null,null,{"$f":"IFERROR(P95*EF_malb_15,\"Veldu þykkt\")","v":0},{"$f":"IFERROR(P95/1000*N95*EF_fl_s+P95/1000*O95*EF_fl_i,\"Veldu þykkt\")","v":0},{"$f":"S95*EF_oil","v":0},0,{"$f":"Z95*(_xlfn.CEILING.MATH(Forsíða!$D$8/ET_malb_15)-1)","v":0},0]
[null,null,"Slitlagsmalbik, ÁDU 3000 - 15000 ","Veldu þykkt","mm",0,"m2",null,"Malbik","Malbik, slitlag","Slitlög","63.43 Slitlagsmalbik","Slitlagsmalbik",0,20,{"$f":"IFERROR(F96*D96/1000*mpV_malb,\"Veldu þykkt\")","v":"Veldu þykkt"},"kg","Slitlagsmalbik",{"$f":"F96*d_malb*mpV_malb*oil_malb","v":0},null,null,null,{"$f":"IFERROR(P96*EF_malb_3_15,\"Veldu þykkt\")","v":"Veldu þykkt"},{"$f":"IFERROR(P96/1000*N96*EF_fl_s+P96/1000*O96*EF_fl_i, \"Veldu þykkt\")","v":"Veldu þykkt"},{"$f":"S96*EF_oil","v":0},0,{"$f":"Z96*(_xlfn.CEILING.MATH(Forsíða!$D$8/ET_malb_3_15)-1)","v":0},0]
[null,null,"Slitlagsmalbik, ÁDU < 3000 og hjóla-/göngustígar","Veldu þykkt","mm",0,"m2",null,"Malbik","Malbik, slitlag","Slitlög","63.43 Slitlagsmalbik","Slitlagsmalbik",0,20,{"$f":"IFERROR(F97*D97/1000*mpV_malb,\"Veldu þykkt\")","v":"Veldu þykkt"},"kg","Slitlagsmalbik",{"$f":"F97*d_malb*mpV_malb*oil_malb","v":0},null,null,null,{"$f":"IFERROR(P97*EF_malb_3,\"Veldu þykkt\")","v":"Veldu þykkt"},{"$f":"IFERROR(P97/1000*N97*EF_fl_s+P97/1000*O97*EF_fl_i,\"Veldu þykkt\")","v":"Veldu þykkt"},{"$f":"S97*EF_oil","v":0},0,{"$f":"Z97*(_xlfn.CEILING.MATH(Forsíða!$D$8/ET_malb_3)-1)","v":0},0]
["68.24",null,"Steypt gangstétt",null,null,0,"m2",null,"Steypa","Steypa, gangstétt","Slitlög","68.24 Steypt gangstétt","Steypt gangstétt",0,20,{"$f":"F98*d_gangs","v":0},"m3","Steypa",null,null,null,null,{"$f":"P98*EF_st_35_gang","v":0},{"$f":"P98*mpV_steypa/1000*N98*EF_fl_s+P98*mpV_steypa/1000*O98*EF_fl_i","v":0},null,0,{"$f":"Z98*(_xlfn.CEILING.MATH(Forsíða!$D$8/ET_gangst_steypa)-1)","v":0},0]
["68.25",null,"Gangstígar/eyjar/hringtorg með hellum",null,null,null,null,null,null,null,null,null,null,null,null,null,null,null,null,null,null,null,null,null,null,null,null,0]
[null,null,"Gangstígar með hellum 6 cm þykkar",60,"mm",0,"m2",null,"Steypa","Steypa, hellur","Slitlög","68.25 Gangstígar/eyjarhringtorg með hellum","Hellur",0,20,{"$f":"F100*D100/1000*mpV_hellur","v":0},"kg","hellur",null,null,null,null,{"$f":"P100*EF_hellur","v":0},{"$f":"P100/1000*N100*EF_fl_s+P100/1000*O100*EF_fl_i","v":0},null,0,{"$f":"Z100*(_xlfn.CEILING.MATH(Forsíða!$D$8/ET_gangst_hellur)-1)","v":0},0]
[null,null,"Gangstígar með hellum 8 cm þykkar",80,"mm",0,"m2",null,"Steypa","Steypa, hellur","Slitlög","68.25 Gangstígar/eyjarhringtorg með hellum","Hellur",0,20,{"$f":"F101*D101/1000*mpV_hellur","v":0},"kg","hellur",null,null,null,null,{"$f":"P101*EF_hellur","v":0},{"$f":"P101/1000*N101*EF_fl_s+P101/1000*O101*EF_fl_i","v":0},null,0,{"$f":"Z101*(_xlfn.CEILING.MATH(Forsíða!$D$8/ET_gangst_hellur)-1)","v":0},0]
[null,null,null,null,null,null,null,null,null,null,null,null,null,null,null,null,null,"Heildarolíunotkun [L]",{"$f":"SUM(S92:S101)","v":0},"Slitlög samtals",null,null,{"$f":"SUM(W92:W101)","v":0},0,0,0,0,0]
["Öryggisbúnaður og frágangur"]
["75.1",null,"Kantsteinar"]
[null,null,"Kantsteinn, hæð 20 cm",null,null,0,"m",null,"Steypa","Steypa, kantsteinn","Öryggisbúnaður og frágangur","75.1 Kantsteinar","Járnbent steypa",0,20,{"$f":"F105*Vpl_kant_st_20","v":0},"m3","steypa",null,null,null,null,{"$f":"P105*EF_st_35_kant","v":0},{"$f":"P105*mpV_steypa/1000*N105*EF_fl_s+P105*mpV_steypa/1000*O105*EF_fl_i","v":0},null,{"$f":"SUM(W105:Y105)","v":0},{"$f":"Z105*(_xlfn.CEILING.MATH(Forsíða!$D$8/ET_kantst)-1)","v":0},{"$f":"SUM(Z105:AA105)","v":0}]
[null,null,null,null,null,null,null,null,"Stál","Kambstál, kansteinn","Öryggisbúnaður og frágangur","75.1 Kantsteinar",null,2800,20,{"$f":"F105*mpl_kant_stal_20","v":0},"kg","járnalögn",null,null,null,null,{"$f":"P106*EF_kamb","v":0},{"$f":"P106/1000*N106*EF_fl_s+P106/1000*O106*EF_fl_i","v":0},null,0,{"$f":"Z106*(_xlfn.CEILING.MATH(Forsíða!$D$8/ET_kantst)-1)","v":0},0]
[null,null,"Kantsteinn, hæð 15 cm",null,null,0,"m",null,"Steypa","Steypa, kantsteinn","Öryggisbúnaður og frágangur","75.1 Kantsteinar","Járnbent steypa",0,20,{"$f":"F107*Vpl_kant_st_15","v":0},"m3","steypa",null,null,null,null,{"$f":"P107*EF_st_35_kant","v":0},{"$f":"P107*mpV_steypa/1000*N107*EF_fl_s+P107*mpV_steypa/1000*O107*EF_fl_i","v":0},null,0,{"$f":"Z107*(_xlfn.CEILING.MATH(Forsíða!$D$8/ET_kantst)-1)","v":0},0]
[null,null,null,null,null,null,null,null,"Stál","Kambstál, kansteinn","Öryggisbúnaður og frágangur","75.1 Kantsteinar",null,2800,20,{"$f":"F107*mpl_kant_stal_15","v":0},"kg","járnalögn",null,null,null,null,{"$f":"P108*EF_kamb","v":0},{"$f":"P108/1000*N108*EF_fl_s+P108/1000*O108*EF_fl_i","v":0},null,0,{"$f":"Z108*(_xlfn.CEILING.MATH(Forsíða!$D$8/ET_kantst)-1)","v":0},0]
[null,null,"Kantsteinn, hæð 10 cm",null,null,0,"m",null,"Steypa","Steypa, kantsteinn","Öryggisbúnaður og frágangur","75.1 Kantsteinar","Járnbent steypa",0,20,{"$f":"F109*Vpl_kant_st_10","v":0},"m3","steypa",null,null,null,null,{"$f":"P109*EF_st_35_kant","v":0},{"$f":"P109*mpV_steypa/1000*N109*EF_fl_s+P109*mpV_steypa/1000*O109*EF_fl_i","v":0},null,0,{"$f":"Z109*(_xlfn.CEILING.MATH(Forsíða!$D$8/ET_kantst)-1)","v":0},0]
[null,null,null,null,null,null,null,null,"Stál","Kambstál, kansteinn","Öryggisbúnaður og frágangur","75.1 Kantsteinar",null,2800,20,{"$f":"F109*mpl_kant_stal_10","v":0},"kg","járnalögn",null,null,null,null,{"$f":"P110*EF_kamb","v":0},{"$f":"P110/1000*N110*EF_fl_s+P110/1000*O110*EF_fl_i","v":0},null,0,{"$f":"Z110*(_xlfn.CEILING.MATH(Forsíða!$D$8/ET_kantst)-1)","v":0},0]
["75.2",null,"Eyjar og hringtorg, jarðvinna, 30 cm lag",null,null,0,"m2",null,"Jarðvinna","Jarðvinna, eyjar","Öryggisbúnaður og frágangur","75.2 Eyjar og hringtorg",null,0,20,{"$f":"F111*d_eyja*(mpV_fb/CF_l_f)","v":0},"kg","jarðefni",{"$f":"F111*d_eyja*Oil_veg","v":0},null,null,null,null,{"$f":"P111*N111*EF_fl_s+P111*O111*EF_fl_mi","v":0},{"$f":"S111*EF_oil","v":0},0,null,0]
["75.6",null,"Vegrið"]
[null,null,"Bitavegrið",null,null,0,"m",null,"Stál","Vegrið, galvaníserað stál","Öryggisbúnaður og frágangur","75.6 Vegrið",null,2800,20,{"$f":"F113*mpl_bvegr","v":0},"kg","galvaníserað stál",null,null,null,null,{"$f":"P113*EF_galvst_vegr","v":0},{"$f":"P113/1000*N113*EF_fl_s+P113/1000*O113*EF_fl_i","v":0},null,0,{"$f":"Z113*(_xlfn.CEILING.MATH(Forsíða!$D$8/ET_bvegr)-1)","v":0},0]
[null,null,"Röravegrið",null,null,0,"m",null,"Stál","Vegrið, galvaníserað stál","Öryggisbúnaður og frágangur","75.6 Vegrið",null,2800,20,{"$f":"F114*mpl_rvegr","v":0},"kg","galvaníserað stál",null,null,null,null,{"$f":"P114*EF_galvst_vegr","v":0},{"$f":"P114/1000*N114*EF_fl_s+P114/1000*O114*EF_fl_i","v":0},null,0,{"$f":"Z114*(_xlfn.CEILING.MATH(Forsíða!$D$8/ET_rvegr)-1)","v":0},0]
[null,null,"Víravegrið",null,null,0,"m",null,"Stál","Vegrið, stál","Öryggisbúnaður og frágangur","75.6 Vegrið",null,2800,20,{"$f":"F115*mpl_vvegr","v":0},"kg","stál",null,null,null,null,{"$f":"P115*EF_stal_vvegr","v":0},{"$f":"P115/1000*N115*EF_fl_s+P115/1000*O115*EF_fl_i","v":0},null,0,{"$f":"Z115*(_xlfn.CEILING.MATH(Forsíða!$D$8/ET_vvegr)-1)","v":0},0]
[null,null,"Steypt vegrið","Varanlegt",null,0,"m",null,"Steypa","Vegrið, steypa","Öryggisbúnaður og frágangur","75.6 Vegrið",null,0,20,{"$f":"F116*Vpl_stevegr","v":0},"m3","steypa",null,null,null,null,{"$f":"IF(D116=\"Varanlegt\",P116*EF_st_35_vegr,P116*EF_st_35_vegr/8)","v":0},{"$f":"P116*mpV_steypa/1000*N116*EF_fl_s+P116*mpV_steypa/1000*O116*EF_fl_i","v":0},null,0,null,0]
["76.45",null,"Ljósastaurar"]
[null,null,"Ljósastaur 4 m","Veldu fjölda ljóskera","ljósker á staur",0,"stk",null,"Stál","Ljósastaur, Galvaníserað stál","Öryggisbúnaður og frágangur","76.45 Ljósastuarar",null,2800,20,{"$f":"F118*mpst_ljos_4","v":0},"kg","galvaníserað stál",null,null,null,null,{"$f":"IFERROR(P118*EF_galvst_staur,\"Veldu fjöldaljóskera\")","v":0},{"$f":"P118/1000*N118*EF_fl_s+P118/1000*O118*EF_fl_i","v":0},null,0,{"$f":"Z118*(_xlfn.CEILING.MATH(Forsíða!$D$8/ET_ljstaur)-1)","v":0},0]
[null,null,null,null,null,null,null,null,"Stál","Ljósastaur, ljósker","Öryggisbúnaður og frágangur","76.45 Ljósastuarar",null,2800,20,{"$f":"IFERROR(F118*D118,\"Ath.  innslátt\")","v":"Ath.  innslátt"},"stk","ljósker",null,null,null,null,{"$f":"IFERROR(P119*EF_ljosker,\"Ath innslátt\")","v":"Ath innslátt"},{"$f":"IFERROR(P119*mpst_ljosker/1000*N119*EF_fl_s+P119*mpst_ljosker/1000*O119*EF_fl_i,\"Ath innslátt\")","v":"Ath innslátt"},null,0,{"$f":"Z119*(_xlfn.CEILING.MATH(Forsíða!$D$8/ET_ljosker)-1)","v":0},0]
[null,null,"Ljósastaur 5 m","Veldu fjölda ljóskera","ljósker á staur",0,"stk",null,"Stál","Ljósastaur, Galvaníserað stál","Öryggisbúnaður og frágangur","76.45 Ljósastuarar",null,2800,20,{"$f":"F120*mpst_ljos_5","v":0},"kg","galvaníserað stál",null,null,null,null,{"$f":"IFERROR(P120*EF_galvst_staur,\"Veldu fjöldaljóskera\")","v":0},{"$f":"P120/1000*N120*EF_fl_s+P120/1000*O120*EF_fl_i","v":0},null,0,{"$f":"Z120*(_xlfn.CEILING.MATH(Forsíða!$D$8/ET_ljstaur)-1)","v":0},0]
[null,null,null,null,null,null,null,null,"Stál","Ljósastaur, ljósker","Öryggisbúnaður og frágangur","76.45 Ljósastuarar",null,2800,20,{"$f":"IFERROR(F120*D120,\"Ath. innslátt\")","v":"Ath. innslátt"},"stk","ljósker",null,null,null,null,{"$f":"IFERROR(P121*EF_ljosker,\"Ath innslátt\")","v":"Ath innslátt"},{"$f":"IFERROR(P121*mpst_ljosker/1000*N121*EF_fl_s+P121*mpst_ljosker/1000*O121*EF_fl_i,\"Ath innslátt\")","v":"Ath innslátt"},null,0,{"$f":"Z121*(_xlfn.CEILING.MATH(Forsíða!$D$8/ET_ljosker)-1)","v":0},0]
[null,null,"Ljósastaur 6,3 m","Veldu fjölda ljóskera","ljósker á staur",0,"stk",null,"Stál","Ljósastaur, Galvaníserað stál","Öryggisbúnaður og frágangur","76.45 Ljósastuarar",null,2800,20,{"$f":"F122*mpst_ljos_6","v":0},"kg","galvaníserað stál",null,null,null,null,{"$f":"IFERROR(P122*EF_galvst_staur,\"Veldu fjöldaljóskera\")","v":0},{"$f":"P122/1000*N122*EF_fl_s+P122/1000*O122*EF_fl_i","v":0},null,0,{"$f":"Z122*(_xlfn.CEILING.MATH(Forsíða!$D$8/ET_ljstaur)-1)","v":0},0]
[null,null,null,null,null,null,null,null,"Stál","Ljósastaur, ljósker","Öryggisbúnaður og frágangur","76.45 Ljósastuarar",null,2800,20,{"$f":"IFERROR(F122*D122,\"Ath. innslátt\")","v":"Ath. innslátt"},"stk","ljósker",null,null,null,null,{"$f":"IFERROR(P123*EF_ljosker,\"Ath innslátt\")","v":"Ath innslátt"},{"$f":"IFERROR(P123*mpst_ljosker/1000*N123*EF_fl_s+P123*mpst_ljosker/1000*O123*EF_fl_i,\"Ath innslátt\")","v":"Ath innslátt"},null,0,{"$f":"Z123*(_xlfn.CEILING.MATH(Forsíða!$D$8/ET_ljosker)-1)","v":0},0]
[null,null,"Ljósastaur 8 m","Veldu fjölda ljóskera","ljósker á staur",0,"stk",null,"Stál","Ljósastaur, Galvaníserað stál","Öryggisbúnaður og frágangur","76.45 Ljósastuarar",null,2800,20,{"$f":"F124*mpst_ljos_8","v":0},"kg","galvaníserað stál",null,null,null,null,{"$f":"IFERROR(P124*EF_galvst_staur,\"Veldu fjöldaljóskera\")","v":0},{"$f":"P124/1000*N124*EF_fl_s+P124/1000*O124*EF_fl_i","v":0},null,{"$f":"SUM(W124:Y124)","v":0},{"$f":"Z124*(_xlfn.CEILING.MATH(Forsíða!$D$8/ET_ljstaur)-1)","v":0},0]
[null,null,null,null,null,null,null,null,"Stál","Ljósastaur, ljósker","Öryggisbúnaður og frágangur","76.45 Ljósastuarar",null,2800,20,{"$f":"IFERROR(F124*D124,\"Ath. innslátt\")","v":"Ath. innslátt"},"stk","ljósker",null,null,null,null,{"$f":"IFERROR(P125*EF_ljosker,\"Ath innslátt\")","v":"Ath innslátt"},{"$f":"IFERROR(P125*mpst_ljosker/1000*N125*EF_fl_s+P125*mpst_ljosker/1000*O125*EF_fl_i,\"Ath innslátt\")","v":"Ath innslátt"},null,0,{"$f":"Z125*(_xlfn.CEILING.MATH(Forsíða!$D$8/ET_ljosker)-1)","v":0},0]
[null,null,"Ljósastaur 10 m","Veldu fjölda ljóskera","ljósker á staur",0,"stk",null,"Stál","Ljósastaur, Galvaníserað stál","Öryggisbúnaður og frágangur","76.45 Ljósastuarar",null,2800,20,{"$f":"F126*mpst_ljos_10","v":0},"kg","galvaníserað stál",null,null,null,null,{"$f":"IFERROR(P126*EF_galvst_staur,\"Veldu fjöldaljóskera\")","v":0},{"$f":"P126/1000*N126*EF_fl_s+P126/1000*O126*EF_fl_i","v":0},null,{"$f":"SUM(W126:Y126)","v":0},{"$f":"Z126*(_xlfn.CEILING.MATH(Forsíða!$D$8/ET_ljstaur)-1)","v":0},0]
[null,null,null,null,null,null,null,null,"Stál","Ljósastaur, ljósker","Öryggisbúnaður og frágangur","76.45 Ljósastuarar",null,2800,20,{"$f":"IFERROR(F126*D126,\"Ath. innslátt\")","v":"Ath. innslátt"},"stk","ljósker",null,null,null,null,{"$f":"IFERROR(P127*EF_ljosker,\"Ath innslátt\")","v":"Ath innslátt"},{"$f":"IFERROR(P127*mpst_ljosker/1000*N127*EF_fl_s+P127*mpst_ljosker/1000*O127*EF_fl_i,\"Ath innslátt\")","v":"Ath innslátt"},null,0,{"$f":"Z127*(_xlfn.CEILING.MATH(Forsíða!$D$8/ET_ljosker)-1)","v":0},0]
["75.62",null,"Vegrið á brú",null,null,0,"m",null,"Stál","Vegrið, galvaníserað stál","Öryggisbúnaður og frágangur","75.62 Vegrið á brú",null,2800,20,{"$f":"F128*mpl_rvegr_bru","v":0},"kg","galvaníserað stál",null,null,null,null,{"$f":"P128*EF_galvst_vegr","v":0},{"$f":"P128/1000*N128*EF_fl_s+P128/1000*O128*EF_fl_i","v":0},null,{"$f":"SUM(W128:Y128)","v":0},{"$f":"Z128*(_xlfn.CEILING.MATH(Forsíða!$D$8/ET_vegr_bru)-1)","v":0},0]
["75.7",null,"Handrið",null,null,0,"m",null,"Stál","Handrið, ryðfrítt stál","Öryggisbúnaður og frágangur","75.7 Handrið",null,2800,20,{"$f":"F129*mpL_handr","v":0},"kg","Ryðfrítt stál",null,null,null,null,{"$f":"P129*EF_St_bru_rf","v":0},{"$f":"P129/1000*N129*EF_fl_s+P129/1000*O129*EF_fl_i","v":0},null,0,null,0]
[null,null,null,null,null,null,null,null,null,null,null,null,null,null,null,null,null,"Heildarolíunotkun [L]",{"$f":"SUM(S104:S129)","v":0},"Öryggisbúnaður og frágangur samtals",null,null,{"$f":"SUM(W104:W129)","v":0},0,0,0,0,0]
[]
[null,null,null,null,null,null,null,null,null,null,null,null,null,null,null,"Heildarolíunotkun framkvæmdar",null,null,{"$f":"SUM(,S130,S102,S88,S80,S17)","v":0},"Öll framkvæmd samtals",null,null,{"$f":"SUM(W130,W102,W88,W80,W17)","v":0},0,0,0,0,0]

{"sheet":"Innsláttur - Brýr","index":4,"n_rows":121,"n_cols":28,"rows_kept":121,"cut":false,"hidden":false,"merged":[[1,19,1,21],[1,22,1,27],[5,0,5,1],[5,2,5,4],[6,0,6,1],[6,2,6,4],[1,10,2,10],[1,11,2,11],[1,12,2,12],[1,15,2,15],[1,16,2,16],[1,17,2,17],[1,0,2,1],[1,2,2,4],[1,5,2,5],[1,6,2,6],[1,8,2,8],[1,9,2,9],[16,19,16,21],[11,2,11,4],[12,2,12,4],[13,0,13,1],[13,2,13,4],[14,0,14,1],[14,2,14,4],[7,0,7,1],[7,2,7,4],[8,2,8,4],[9,2,9,4],[10,0,10,1],[10,2,10,4],[25,2,25,4],[26,2,26,4],[19,2,19,4],[20,2,20,4],[21,2,21,4],[22,2,22,4],[23,2,23,4],[24,2,24,4],[18,2,18,4],[28,6,30,6],[28,12,30,12],[31,2,33,4],[31,5,33,5],[31,6,33,6],[31,12,33,12],[27,2,27,4],[28,2,30,4],[28,5,30,5],[40,2,40,4],[41,2,41,4],[42,2,42,4],[43,2,43,4],[47,19,47,21],[34,2,36,4],[34,5,36,5],[34,6,36,6],[34,12,36,12],[37,2,39,4],[37,5,39,5],[37,6,39,6],[37,12,39,12],[62,0,62,1],[62,2,62,4],[63,2,64,4],[63,5,64,5],[60,19,60,21],[61,0,61,27],[51,0,51,1],[52,0,52,1],[52,2,52,4],[56,0,56,1],[56,2,56,4],[57,0,57,1],[57,2,57,4],[67,12,68,12],[69,0,69,1],[69,2,69,4],[63,6,64,6],[63,12,64,12],[65,2,66,4],[65,5,66,5],[65,6,66,6],[65,12,66,12],[70,0,70,1],[70,2,70,4],[71,0,71,1],[71,2,71,4],[72,0,72,1],[72,2,72,4],[67,2,68,4],[67,5,68,5],[67,6,68,6],[76,5,77,5],[76,6,77,6],[78,2,79,2],[78,3,79,3],[78,4,79,4],[78,5,79,5],[78,6,79,6],[73,0,73,1],[73,2,73,4],[74,0,74,1],[75,0,75,1],[75,2,75,4],[76,2,77,2],[76,3,77,3],[76,4,77,4],[84,2,85,2],[84,3,85,3],[84,4,85,4],[84,5,85,5],[84,6,85,6],[86,0,86,1],[86,2,86,4],[80,2,81,2],[80,3,81,3],[80,4,81,4],[80,5,81,5],[80,6,81,6],[82,2,83,2],[82,3,83,3],[82,4,83,4],[82,5,83,5],[82,6,83,6],[93,0,93,1],[93,2,93,4],[94,2,94,4],[95,0,95,1],[95,2,95,4],[96,0,96,1],[96,2,96,4],[87,2,87,4],[92,0,92,1],[92,2,92,4],[91,2,91,4],[89,0,89,27],[88,19,88,21],[90,2,90,4],[107,2,107,4],[101,0,101,1],[102,0,102,1],[102,2,102,4],[103,0,103,1],[103,2,103,4],[104,0,104,1],[104,2,104,4],[97,0,97,1],[97,2,97,4],[98,2,98,4],[99,0,99,1],[99,2,99,4],[100,0,100,1],[100,2,100,4],[50,0,50,27],[17,0,17,27],[4,0,4,27],[15,0,15,1],[15,2,15,4],[120,15,120,17],[120,19,120,21],[125,18,125,21],[116,0,117,1],[116,2,117,4],[116,5,117,5],[116,6,117,6],[118,19,118,21],[108,0,108,1],[108,2,108,4],[111,0,111,1],[111,2,111,4],[112,0,112,1],[112,2,112,4],[105,0,105,1],[105,2,105,4],[106,0,106,1],[106,2,106,4],[107,0,107,1]]}
[]
["Númer verkþáttar",null,"Heiti verkþáttar",null,null,"Magn","Eining",null,"Flokkur, gróft","Flokkur, ítarlegt","Yfirverkþáttur","Undirverkþáttur","Efni","Flutningsvegalengd [km]",null,"Magn","Eining","Efni","Olíunotkun [L]","Önnur efnisnotkun",null,null,"Losun (kg CO2-íg.)"]
[null,null,null,null,null,null,null,null,null,null,null,null,null,"Á sjó","Innanlands",null,null,null,"Magn","Magn","Eining","Skýring","A1-A3","A4","A5","A1-A5","B4","A1-A5 + B4"]
[]
["Skeringar og undirbygging"]
["32.1",null,"Bergskeringar í vegstæði",null,null,0,"m3 ",null,"Jarðvinna","Jarðvinna, bergskeringar","Skeringar og undirbygging","32.1 Bergskeringar í vegstæði","Fast berg",2800,20,{"$f":"F6*spr_fb","v":0},"kg","Sprengiefni",{"$f":"F6*Oil_bor","v":0},{"$f":"P6","v":0},"kg","Sprengiefni",{"$f":"P6*EF_spr","v":0},{"$f":"P6/1000*N6*EF_fl_s+P6/1000*O6*EF_fl_i","v":0},{"$f":"S6*EF_oil+T6*EF_spr","v":0},{"$f":"SUM(W6:Y6)","v":0},null,{"$f":"SUM(Z6:AA6)","v":0}]
["32.2",null,"Bergskeringar í námu",null,null,0,"m3 ",null,"Jarðvinna","Jarðvinna, bergskeringar","Skeringar og undirbygging","32.2 Bergskeringar í námu","Fast berg",2800,20,{"$f":"F7*spr_fb","v":0},"kg","Sprengiefni",{"$f":"F7*Oil_bor","v":0},{"$f":"P7","v":0},"kg","Sprengiefni",{"$f":"P7*EF_spr","v":0},{"$f":"P7/1000*N7*EF_fl_s+P7/1000*O7*EF_fl_i","v":0},{"$f":"S7*EF_oil+T7*EF_spr","v":0},{"$f":"SUM(W7:Y7)","v":0},null,{"$f":"SUM(Z7:AA7)","v":0}]
["33.1",null,"Fyllingarefni úr skeringum",null,null,null,null,null,null,null,null,null,null,null,null,null,null,null,null,null,null,null,null,null,null,null,null,0]
[null,null,"Þar af laust fyllingarefni",null,null,0,"m3 ",null,"Jarðvinna","Jarðvinna, fyllingarefni","Skeringar og undirbygging","33.1 Fyllingarefni úr skeringum","Þjappað fyllingarefni",0,20,null,null,null,{"$f":"F9*(Oil_veg+Oil_grafa+Oil_yta+Oil_valt)","v":0},null,null,null,null,{"$f":"F9*mpV_fb/CF_þ_f*N9*EF_fl_s+F9*mpV_fb/CF_þ_f*O9*EF_fl_mi","v":0},{"$f":"S9*EF_oil","v":0},0,null,0]
[null,null,"Þar af sprengt fyllingarefni",null,null,0,"m3",null,"Jarðvinna","Jarðvinna, fyllingarefni","Skeringar og undirbygging","33.1 Fyllingarefni úr skeringum","Þjappað fyllingarefni",0,20,null,null,null,{"$f":"F10*(Oil_grafa*2+Oil_yta+Oil_valt)","v":0},null,null,null,null,{"$f":"F10*mpV_fb/CF_þ_f*N10*EF_fl_s+F10*mpV_fb/CF_þ_f*O10*EF_fl_mi","v":0},{"$f":"S10*EF_oil","v":0},0,null,0]
["33.2",null,"Fyllingarefni úr námu",null,null,null,null,null,null,null,null,null,null,null,null,null,null,null,null,null,null,null,null,null,null,null,null,0]
[null,null,"Laust fyllingarefni",null,null,0,"m3",null,"Jarðvinna","Jarðvinna, fyllingarefni","Skeringar og undirbygging","33.2 Fyllingarefni úr námu","Þjappað fyllingarefni",0,20,null,null,null,{"$f":"F12*(Oil_grafa*2+Oil_yta+Oil_valt)","v":0},null,null,null,null,{"$f":"F12*mpV_fb/CF_þ_f*N12*EF_fl_s+F12*mpV_fb/CF_þ_f*O12*EF_fl_mi","v":0},{"$f":"S12*EF_oil","v":0},0,null,0]
[null,null,"Sprengt fyllingarefni",null,null,0,"m3",null,"Jarðvinna","Jarðvinna, fyllingarefni","Skeringar og undirbygging","33.2 Fyllingarefni úr námu","Þjappað fyllingarefni",0,20,null,null,null,{"$f":"F13*(Oil_grafa*2+Oil_yta+Oil_valt)","v":0},null,null,null,null,{"$f":"F13*mpV_fb/CF_þ_f*N13*EF_fl_s+F13*mpV_fb/CF_þ_f*O13*EF_fl_mi","v":0},{"$f":"S13*EF_oil","v":0},0,null,0]
["34.1",null,"Fláafleygar, efni úr skeringum",null,null,0,"m3",null,"Jarðvinna","Jarðvinna, fláafleygar","Skeringar og undirbygging","34.1 Fláafleygar, efni úr skeringum",null,0,20,null,null,null,{"$f":"F14*(Oil_veg+Oil_grafa+Oil_yta)","v":0},null,null,null,null,{"$f":"F14*mpV_fb/CF_l_f*N14*EF_fl_s+F14*mpV_fb/CF_l_f*O14*EF_fl_mi","v":0},{"$f":"S14*EF_oil","v":0},0,null,0]
["34.8",null,"Ónothæfu efni jafnað á losunarstað",null,null,0,"m3",null,"Jarðvinna","Jarðvinna, ónothæft efni","Skeringar og undirbygging","34.8 Ónothæfu efni jafnað á losunarstað",null,0,20,null,null,null,{"$f":"F15*(Oil_veg+Oil_yta)","v":0},null,null,null,null,{"$f":"F15*mpV_fb/CF_l_f*N15*EF_fl_s+F15*mpV_fb/CF_l_f*O15*EF_fl_mi","v":0},{"$f":"S15*EF_oil","v":0},0,null,0]
["36.2",null,"Grjótvörn",null,null,0,"m3",null,"Jarðvinna","Jarðvinna, grjótvörn","Skeringar og undirbygging","36.2 Grjótvörn",null,0,20,{"$f":"F16","v":0},"m3","grjót >2 tonn",{"$f":"F16*Oil_grjot","v":0},null,null,null,{"$f":"P16*EF_grjot","v":0},{"$f":"F16*mpV_grjot*N16*EF_fl_s+F16*mpV_grjot*O16*EF_fl_mi","v":0},{"$f":"S16*EF_oil","v":0},0,null,0]
[null,null,null,null,null,null,null,null,null,null,null,null,null,null,null,null,null,"Heildarolíunotkun [L]",{"$f":"SUM(S6:S16)","v":0},"Skeringar og undirbygging samtals",null,null,{"$f":"SUM(W6:W16)","v":0},0,0,0,0,{"$f":"SUM(AB6:AB16)","v":0}]
["Ræsi og veitur"]
["42.3",null,"Plaströr, fráveita"]
[null,null,"Fráveiturör, D = 250 - 400 mm",null,null,0,"m",null,"Plast","Plast, fráveiturör","Ræsi og veitur","42.3 Plaströr, fráveita","Plaströr",2800,20,{"$f":"F20*mpl_FVror_04","v":0},"kg","Plast, X-Stream",null,null,null,null,{"$f":"P20*EF_FV_Xstr","v":0},{"$f":"P20/1000*N20*EF_fl_s+P20/1000*O20*EF_fl_i","v":0},null,{"$f":"SUM(W20:Y20)","v":0},null,{"$f":"SUM(Z20:AA20)","v":0}]
[null,null,"Fráveiturör, D = 401 - 600 mm",null,null,0,"m",null,"Plast","Plast, fráveiturör","Ræsi og veitur","42.3 Plaströr, fráveita","Plaströr",2800,20,{"$f":"F21*mpl_FVror_06","v":0},"kg","Plast, X-Stream",null,null,null,null,{"$f":"P21*EF_FV_Xstr","v":0},0,null,0,null,0]
[null,null,"Fráveiturör, D = 601 - 800 mm",null,null,0,"m",null,"Plast","Plast, fráveiturör","Ræsi og veitur","42.3 Plaströr, fráveita","Plaströr",2800,20,{"$f":"F22*mpl_FVror_08","v":0},"kg","Plast, X-Stream",null,null,null,null,{"$f":"P22*EF_FV_Xstr","v":0},0,null,0,null,0]
[null,null,"Fráveiturör, D = 801 - 1000 mm",null,null,0,"m",null,"Plast","Plast, fráveiturör","Ræsi og veitur","42.3 Plaströr, fráveita","Plaströr",2800,20,{"$f":"F23*mpl_FVror_10","v":0},"kg","Plast, Weholite",null,null,null,null,{"$f":"P23*EF_FV_Weh","v":0},0,null,0,null,0]
[null,null,"Fráveiturör, D = 1001 - 1400 mm",null,null,0,"m",null,"Plast","Plast, fráveiturör","Ræsi og veitur","42.3 Plaströr, fráveita","Plaströr",2800,20,{"$f":"F24*mpl_FVror_14","v":0},"kg","Plast, Weholite",null,null,null,null,{"$f":"P24*EF_FV_Weh","v":0},0,null,0,null,0]
[null,null,"Fráveiturör, D = 1401 - 1800 mm",null,null,0,"m",null,"Plast","Plast, fráveiturör","Ræsi og veitur","42.3 Plaströr, fráveita","Plaströr",2800,20,{"$f":"F25*mpl_FVror_18","v":0},"kg","Plast, Weholite",null,null,null,null,{"$f":"P25*EF_FV_Weh","v":0},0,null,0,null,0]
[null,null,"Fráveiturör, D = 1801 - 2200 mm",null,null,0,"m",null,"Plast","Plast, fráveiturör","Ræsi og veitur","42.3 Plaströr, fráveita","Plaströr",2800,20,{"$f":"F26*mpl_FVror_22","v":0},"kg","Plast, Weholite",null,null,null,null,{"$f":"P26*EF_FV_Weh","v":0},0,null,0,null,0]
[null,null,"Fráveiturör, D > 2200 mm",null,null,0,"m",null,"Plast","Plast, fráveiturör","Ræsi og veitur","42.3 Plaströr, fráveita","Plaströr",2800,20,{"$f":"F27*mpl_FVror_22p","v":0},"kg","Plast, Weholite",null,null,null,null,{"$f":"P27*EF_FV_Weh","v":0},0,null,0,null,0]
["45.5",null,"Brunnar (plastbrunnar með steyptum flotkarmi og stálloki)"]
[null,null,"Brunnur, D = 600 mm, dýpt = 0-2,5 m",null,null,0,"stk",null,"Plast","Plast, brunnur","Ræsi og veitur","45.5 Brunnar","PP brunnur",2800,20,{"$f":"F29*(mpst_Br_06+mpl_BrUp_06*1)","v":0},"kg","Plast, PP",null,null,null,null,{"$f":"P29*EF_PP","v":0},{"$f":"P29/1000*N29*EF_fl_s+P29/1000*O29*EF_fl_i","v":0},null,{"$f":"SUM(W29:Y29)","v":0},null,{"$f":"SUM(Z29:AA29)","v":0}]
[null,null,null,null,null,null,null,null,"Steypa","Steypa, flotkarmur","Ræsi og veitur","45.5 Brunnar",null,2800,20,{"$f":"F29*mpst_flotk","v":0},"kg","Steyptur flotkarmur",null,null,null,null,{"$f":"P30/mpV_steypa*EF_St_ror","v":0},0,null,0,null,{"$f":"SUM(Z30:AA30)","v":0}]
[null,null,null,null,null,null,null,null,"Stál","Stál, brunnlok","Ræsi og veitur","45.5 Brunnar",null,2800,20,{"$f":"F29*mpst_br_lok","v":0},"kg","Stállok",null,null,null,null,{"$f":"P31*EF_Stal_ror","v":0},0,null,0,null,0]
[null,null,"Brunnur, D = 600 mm, dýpt > 2,5 m",null,null,0,"stk",null,"Plast","Plast, brunnur","Ræsi og veitur","45.5 Brunnar","PP brunnur",2800,20,{"$f":"F32*(mpst_Br_06+mpl_BrUp_06*3)","v":0},"kg","Plast, PP",null,null,null,null,{"$f":"P32*EF_PP","v":0},0,null,0,null,0]
[null,null,null,null,null,null,null,null,"Steypa","Steypa, flotkarmur","Ræsi og veitur","45.5 Brunnar",null,2800,20,{"$f":"F32*mpst_flotk","v":0},"kg","Steyptur flotkarmur",null,null,null,null,{"$f":"P33*EF_St_ror","v":0},0,null,0,null,0]
[null,null,null,null,null,null,null,null,"Stál","Stál, brunnlok","Ræsi og veitur","45.5 Brunnar",null,2800,20,{"$f":"F32*mpst_br_lok","v":0},"kg","Stállok",null,null,null,null,{"$f":"P34*EF_Stal_ror","v":0},0,null,0,null,0]
[null,null,"Brunnur, D = 1000 mm, dýpt = 0-2,5 m",null,null,0,"stk",null,"Plast","Plast, brunnur","Ræsi og veitur","45.5 Brunnar","PP brunnur",2800,20,{"$f":"F35*(mpst_Br_10+mpl_BrUp_10*1)","v":0},"kg","Plast, PP",null,null,null,null,{"$f":"P35*EF_PP","v":0},0,null,0,null,0]
[null,null,null,null,null,null,null,null,"Steypa","Steypa, flotkarmur","Ræsi og veitur","45.5 Brunnar",null,2800,20,{"$f":"F35*mpst_flotk","v":0},"kg","Steyptur flotkarmur",null,null,null,null,{"$f":"P36*EF_St_ror","v":0},0,null,0,null,0]
[null,null,null,null,null,null,null,null,"Stál","Stál, brunnlok","Ræsi og veitur","45.5 Brunnar",null,2800,20,{"$f":"F35*mpst_br_lok","v":0},"kg","Stállok",null,null,null,null,{"$f":"P37*EF_Stal_ror","v":0},0,null,0,null,0]
[null,null,"Brunnur, D = 1000 mm, dýpt > 2,5 m",null,null,0,"stk",null,"Plast","Plast, brunnur","Ræsi og veitur","45.5 Brunnar","PP brunnur",2800,20,{"$f":"F38*(mpst_Br_10+mpl_BrUp_10*3)","v":0},"kg","Plast, PP",null,null,null,null,{"$f":"P38*EF_PP","v":0},0,null,0,null,0]
[null,null,null,null,null,null,null,null,"Steypa","Steypa, flotkarmur","Ræsi og veitur","45.5 Brunnar",null,2800,20,{"$f":"F38*mpst_flotk","v":0},"kg","Steyptur flotkarmur",null,null,null,null,{"$f":"P39*EF_St_ror","v":0},0,null,0,null,0]
[null,null,null,null,null,null,null,null,"Stál","Stál, brunnlok","Ræsi og veitur","45.5 Brunnar",null,2800,20,{"$f":"F38*mpst_br_lok","v":0},"kg","Stállok",null,null,null,null,{"$f":"P40*EF_Stal_ror","v":0},0,null,0,null,0]
["45.6",null,"Niðurföll / sandfang",null,null,0,"stk",null,"Plast","Plast, niðurfall","Ræsi og veitur","45.6 Niðurföll / sandfang","PP niðurfall",2800,20,{"$f":"F41*mpst_nfall","v":0},"kg","Plast, PP",null,null,null,null,{"$f":"P41*EF_PP","v":0},0,null,0,null,0]
["45.68",null,"Grjótsvelgur",null,null,null,null,null,"Plast","Plast, Grjótsvelgur","Ræsi og veitur","45.68 Grjótsvelgur"]
["45.1 + 45.8",null,"Gröftur lagnaskurða og fylling í skurði",null,null,0,"m3",null,"Jarðvinna","Jarðvinna, lagnaskurðir","Ræsi og veitur","45.1 + 45.8 Gröftur lagnaskurða og fylling í skurði","Þjappað fyllingarefni",0,20,null,null,null,{"$f":"F43*(Oil_grafa+Oil_grafa+Oil_yta)","v":0},null,null,null,null,{"$f":"F43*mpV_fb/CF_þ_f*N43*EF_fl_s+F43*mpV_fb/CF_þ_f*O43*EF_fl_mi","v":0},{"$f":"S43*EF_oil","v":0},0,null,0]
[null,null,"Rafstrengir, ljósleiðari o.s.frv"]
[null,null,"Ljósleiðari",null,null,0,"m",null,"Rafstrengur","Rafstrengur","Ræsi og veitur","Rafstrengir","Ljósleiðari",2800,20,{"$f":"F45","v":0},"m","Ljósleiðari",null,null,null,null,{"$f":"P45*EF_ljosleid","v":0},{"$f":"P45*mpL_rafstr_1kv/1000*N45*EF_fl_s+P45*mpL_rafstr_1kv/1000*O45*EF_fl_i","v":0},null,{"$f":"SUM(W45:Y45)","v":0},null,0]
[null,null,"Rafstrengur, lágspenna (< 11 kV)",null,null,0,"m",null,"Rafstrengur","Rafstrengur","Ræsi og veitur","Rafstrengir","Rafstrengur, 1 kV",2800,20,{"$f":"F46","v":0},"m","Rafstrengur, 1 kV",null,null,null,null,{"$f":"P46*EF_strengur_1kv","v":0},{"$f":"P46*mpL_rafstr_1kv/1000*N46*EF_fl_s+P46*mpL_rafstr_1kv/1000*O46*EF_fl_i","v":0},null,{"$f":"SUM(W46:Y46)","v":0},null,0]
[null,null,"Rafstrengur, háspenna (≥ 11 kV)",null,null,0,"m",null,"Rafstrengur","Rafstrengur","Ræsi og veitur","Rafstrengir","Rafstrengur, 24 kV",2800,20,{"$f":"F47","v":0},"m","Rafstrengur, 24 kV",null,null,null,null,{"$f":"P47*EF_strengur_24kv","v":0},{"$f":"P47*mpL_rafstr_24kv/1000*N47*EF_fl_s+P47*mpL_rafstr_24kv/1000*O47*EF_fl_i","v":0},null,0,null,0]
[null,null,null,null,null,null,null,null,null,null,null,null,null,null,null,null,null,"Heildarolíunotkun [L]",{"$f":"SUM(S19:S47)","v":0},"Ræsi og veitur samtals",null,null,{"$f":"SUM(W19:W47)","v":0},0,0,0,0,0]
["53.4",null,"Bikbundið burðarlag",null,null,"Geyma"]
["53.5",null,"Sementsbundið burðarlag",null,null,"Geyma"]
["Slitlög"]
["63.42",null,"Burðarlagsmalbik","Veldu þykkt","mm",0,"m2",null,"Malbik","Malbik, burðarlag","Slitlög","63.42 Burðarlagsmalbik","Burðarlagsmalbik",0,20,{"$f":"IFERROR(IF(F52=0,0,F52*D52/1000*mpV_malb),\"Veldu þykkt\")","v":0},"kg","Burðarlagsmalbik",{"$f":"F52*d_malb*mpV_malb*oil_malb","v":0},null,null,null,{"$f":"P52*EF_malb_bur","v":0},{"$f":"P52/1000*N52*EF_fl_s+P52/1000*O52*EF_fl_i","v":0},{"$f":"S52*EF_oil","v":0},{"$f":"SUM(W52:Y52)","v":0},{"$f":"Z52*(_xlfn.CEILING.MATH(Forsíða!$D$8/ET_malb_bur)-1)","v":0},{"$f":"SUM(Z52:AA52)","v":0}]
["63.43",null,"Slitlagsmalbik",null,null,null,null,null,null,null,null,null,null,null,null,null,null,null,null,null,null,null,null,null,null,null,null,0]
[null,null,"Slitlagsmalbik, ÁDU > 15000 ","Veldu þykkt","mm",0,"m2",null,"Malbik","Malbik, slitlag","Slitlög","63.43 Slitlagsmalbik","Slitlagsmalbik",0,20,{"$f":"IFERROR(IF(F54=0,0,F54*D54/1000*mpV_malb),\"Veldu þykkt\")","v":0},"kg","Slitlagsmalbik",{"$f":"F54*d_malb*mpV_malb*oil_malb","v":0},null,null,null,{"$f":"IFERROR(P54*EF_malb_15,\"Veldu þykkt\")","v":0},{"$f":"IFERROR(P54/1000*N54*EF_fl_s+P54/1000*O54*EF_fl_i,\"Veldu þykkt\")","v":0},{"$f":"S54*EF_oil","v":0},{"$f":"SUM(W54:Y54)","v":0},{"$f":"Z54*(_xlfn.CEILING.MATH(Forsíða!$D$8/ET_malb_15)-1)","v":0},0]
[null,null,"Slitlagsmalbik, ÁDU 3000 - 15000 ","Veldu þykkt","mm",0,"m2",null,"Malbik","Malbik, slitlag","Slitlög","63.43 Slitlagsmalbik","Slitlagsmalbik",0,20,{"$f":"IFERROR(F55*D55/1000*mpV_malb,\"Veldu þykkt\")","v":"Veldu þykkt"},"kg","Slitlagsmalbik",{"$f":"F55*d_malb*mpV_malb*oil_malb","v":0},null,null,null,{"$f":"IFERROR(P55*EF_malb_3_15,\"Veldu þykkt\")","v":"Veldu þykkt"},{"$f":"IFERROR(P55/1000*N55*EF_fl_s+P55/1000*O55*EF_fl_i, \"Veldu þykkt\")","v":"Veldu þykkt"},{"$f":"S55*EF_oil","v":0},0,{"$f":"Z55*(_xlfn.CEILING.MATH(Forsíða!$D$8/ET_malb_3_15)-1)","v":0},0]
[null,null,"Slitlagsmalbik, ÁDU < 3000 og hjóla-/göngustígar","Veldu þykkt","mm",0,"m2",null,"Malbik","Malbik, slitlag","Slitlög","63.43 Slitlagsmalbik","Slitlagsmalbik",0,20,{"$f":"IFERROR(F56*D56/1000*mpV_malb,\"Veldu þykkt\")","v":"Veldu þykkt"},"kg","Slitlagsmalbik",{"$f":"F56*d_malb*mpV_malb*oil_malb","v":0},null,null,null,{"$f":"IFERROR(P56*EF_malb_3,\"Veldu þykkt\")","v":"Veldu þykkt"},{"$f":"IFERROR(P56/1000*N56*EF_fl_s+P56/1000*O56*EF_fl_i,\"Veldu þykkt\")","v":"Veldu þykkt"},{"$f":"S56*EF_oil","v":0},0,{"$f":"Z56*(_xlfn.CEILING.MATH(Forsíða!$D$8/ET_malb_3)-1)","v":0},0]
["68.24",null,"Steypt gangstétt",null,null,0,"m2",null,"Steypa","Steypa, gangstétt","Slitlög","68.24 Steypt gangstétt","Steypt gangstétt",0,20,{"$f":"F57*d_gangs","v":0},"m3","Steypa",null,null,null,null,{"$f":"P57*EF_st_35_gang","v":0},{"$f":"P57*mpV_steypa/1000*N57*EF_fl_s+P57*mpV_steypa/1000*O57*EF_fl_i","v":0},null,0,{"$f":"Z57*(_xlfn.CEILING.MATH(Forsíða!$D$8/ET_gangst_steypa)-1)","v":0},0]
["68.25",null,"Gangstígar/eyjar/hringtorg með hellum",null,null,null,null,null,null,null,null,null,null,null,null,null,null,null,null,null,null,null,null,null,null,null,null,0]
[null,null,"Gangstígar með hellum 6 cm þykkar",60,"mm",0,"m2",null,"Steypa","Steypa, hellur","Slitlög","68.25 Gangstígar/eyjarhringtorg með hellum","Hellur",0,20,{"$f":"F59*D59/1000*mpV_hellur","v":0},"kg","hellur",null,null,null,null,{"$f":"P59*EF_hellur","v":0},{"$f":"P59/1000*N59*EF_fl_s+P59/1000*O59*EF_fl_i","v":0},null,{"$f":"SUM(W59:Y59)","v":0},{"$f":"Z59*(_xlfn.CEILING.MATH(Forsíða!$D$8/ET_gangst_hellur)-1)","v":0},0]
[null,null,"Gangstígar með hellum 8 cm þykkar",80,"mm",0,"m2",null,"Steypa","Steypa, hellur","Slitlög","68.25 Gangstígar/eyjarhringtorg með hellum","Hellur",0,20,{"$f":"F60*D60/1000*mpV_hellur","v":0},"kg","hellur",null,null,null,null,{"$f":"P60*EF_hellur","v":0},{"$f":"P60/1000*N60*EF_fl_s+P60/1000*O60*EF_fl_i","v":0},null,0,{"$f":"Z60*(_xlfn.CEILING.MATH(Forsíða!$D$8/ET_gangst_hellur)-1)","v":0},0]
[null,null,null,null,null,null,null,null,null,null,null,null,null,null,null,null,null,"Heildarolíunotkun [L]",{"$f":"SUM(S52:S60)","v":0},"Slitlög samtals",null,null,{"$f":"SUM(W52:W60)","v":0},0,0,0,0,0]
["Öryggisbúnaður og frágangur"]
["75.1",null,"Kantsteinar"]
[null,null,"Kantsteinn, hæð 20 cm",null,null,0,"m",null,"Steypa","Steypa, kantsteinn","Öryggisbúnaður og frágangur","75.1 Kantsteinar","Járnbent steypa",0,20,{"$f":"F64*Vpl_kant_st_20","v":0},"m3","steypa",null,null,null,null,{"$f":"P64*EF_st_35_kant","v":0},{"$f":"P64*mpV_steypa/1000*N64*EF_fl_s+P64*mpV_steypa/1000*O64*EF_fl_i","v":0},null,{"$f":"SUM(W64:Y64)","v":0},{"$f":"Z64*(_xlfn.CEILING.MATH(Forsíða!$D$8/ET_kantst)-1)","v":0},{"$f":"SUM(Z64:AA64)","v":0}]
[null,null,null,null,null,null,null,null,"Stál","Kambstál, kansteinn","Öryggisbúnaður og frágangur","75.1 Kantsteinar",null,2800,20,{"$f":"F64*mpl_kant_stal_20","v":0},"kg","járnalögn",null,null,null,null,{"$f":"P65*EF_kamb","v":0},{"$f":"P65/1000*N65*EF_fl_s+P65/1000*O65*EF_fl_i","v":0},null,0,{"$f":"Z65*(_xlfn.CEILING.MATH(Forsíða!$D$8/ET_kantst)-1)","v":0},0]
[null,null,"Kantsteinn, hæð 15 cm",null,null,0,"m",null,"Steypa","Steypa, kantsteinn","Öryggisbúnaður og frágangur","75.1 Kantsteinar","Járnbent steypa",0,20,{"$f":"F66*Vpl_kant_st_15","v":0},"m3","steypa",null,null,null,null,{"$f":"P66*EF_st_35_kant","v":0},{"$f":"P66*mpV_steypa/1000*N66*EF_fl_s+P66*mpV_steypa/1000*O66*EF_fl_i","v":0},null,0,{"$f":"Z66*(_xlfn.CEILING.MATH(Forsíða!$D$8/ET_kantst)-1)","v":0},0]
[null,null,null,null,null,null,null,null,"Stál","Kambstál, kansteinn","Öryggisbúnaður og frágangur","75.1 Kantsteinar",null,2800,20,{"$f":"F66*mpl_kant_stal_15","v":0},"kg","járnalögn",null,null,null,null,{"$f":"P67*EF_kamb","v":0},{"$f":"P67/1000*N67*EF_fl_s+P67/1000*O67*EF_fl_i","v":0},null,0,{"$f":"Z67*(_xlfn.CEILING.MATH(Forsíða!$D$8/ET_kantst)-1)","v":0},0]
[null,null,"Kantsteinn, hæð 10 cm",null,null,0,"m",null,"Steypa","Steypa, kantsteinn","Öryggisbúnaður og frágangur","75.1 Kantsteinar","Járnbent steypa",0,20,{"$f":"F68*Vpl_kant_st_10","v":0},"m3","steypa",null,null,null,null,{"$f":"P68*EF_st_35_kant","v":0},{"$f":"P68*mpV_steypa/1000*N68*EF_fl_s+P68*mpV_steypa/1000*O68*EF_fl_i","v":0},null,0,{"$f":"Z68*(_xlfn.CEILING.MATH(Forsíða!$D$8/ET_kantst)-1)","v":0},0]
[null,null,null,null,null,null,null,null,"Stál","Kambstál, kansteinn","Öryggisbúnaður og frágangur","75.1 Kantsteinar",null,2800,20,{"$f":"F68*mpl_kant_stal_10","v":0},"kg","járnalögn",null,null,null,null,{"$f":"P69*EF_kamb","v":0},{"$f":"P69/1000*N69*EF_fl_s+P69/1000*O69*EF_fl_i","v":0},null,0,{"$f":"Z69*(_xlfn.CEILING.MATH(Forsíða!$D$8/ET_kantst)-1)","v":0},0]
["75.2",null,"Eyjar og hringtorg, jarðvinna, 30 cm lag",null,null,0,"m2",null,"Jarðvinna","Jarðvinna, eyjar","Öryggisbúnaður og frágangur","75.2 Eyjar og hringtorg",null,0,20,{"$f":"F70*d_eyja*(mpV_fb/CF_l_f)","v":0},"kg","jarðefni",{"$f":"F70*d_eyja*Oil_veg","v":0},null,null,null,null,{"$f":"P70*N70*EF_fl_s+P70*O70*EF_fl_mi","v":0},{"$f":"S70*EF_oil","v":0},0,null,0]
["75.6",null,"Vegrið"]
[null,null,"Bitavegrið",null,null,0,"m",null,"Stál","Vegrið, galvaníserað stál","Öryggisbúnaður og frágangur","75.6 Vegrið",null,2800,20,{"$f":"F72*mpl_bvegr","v":0},"kg","galvaníserað stál",null,null,null,null,{"$f":"P72*EF_galvst_vegr","v":0},{"$f":"P72/1000*N72*EF_fl_s+P72/1000*O72*EF_fl_i","v":0},null,0,{"$f":"Z72*(_xlfn.CEILING.MATH(Forsíða!$D$8/ET_bvegr)-1)","v":0},0]
[null,null,"Röravegrið",null,null,0,"m",null,"Stál","Vegrið, galvaníserað stál","Öryggisbúnaður og frágangur","75.6 Vegrið",null,2800,20,{"$f":"F73*mpl_rvegr","v":0},"kg","galvaníserað stál",null,null,null,null,{"$f":"P73*EF_galvst_vegr","v":0},{"$f":"P73/1000*N73*EF_fl_s+P73/1000*O73*EF_fl_i","v":0},null,0,{"$f":"Z73*(_xlfn.CEILING.MATH(Forsíða!$D$8/ET_rvegr)-1)","v":0},0]
[null,null,"Víravegrið",null,null,0,"m",null,"Stál","Vegrið, stál","Öryggisbúnaður og frágangur","75.6 Vegrið",null,2800,20,{"$f":"F74*mpl_vvegr","v":0},"kg","stál",null,null,null,null,{"$f":"P74*EF_stal_vvegr","v":0},{"$f":"P74/1000*N74*EF_fl_s+P74/1000*O74*EF_fl_i","v":0},null,0,{"$f":"Z74*(_xlfn.CEILING.MATH(Forsíða!$D$8/ET_vvegr)-1)","v":0},0]
[null,null,"Steypt vegrið","Varanlegt",null,0,"m",null,"Steypa","Vegrið, steypa","Öryggisbúnaður og frágangur","75.6 Vegrið",null,0,20,{"$f":"F75*Vpl_stevegr","v":0},"m3","steypa",null,null,null,null,{"$f":"IF(D75=\"Varanlegt\",P75*EF_st_35_vegr,P75*EF_st_35_vegr/8)","v":0},{"$f":"P75*mpV_steypa/1000*N75*EF_fl_s+P75*mpV_steypa/1000*O75*EF_fl_i","v":0},null,0,null,0]
["76.45",null,"Ljósastaurar"]
[null,null,"Ljósastaur 4 m","Veldu fjölda ljóskera","ljósker á staur",0,"stk",null,"Stál","Ljósastaur, Galvaníserað stál","Öryggisbúnaður og frágangur","76.45 Ljósastuarar",null,2800,20,{"$f":"F77*mpst_ljos_4","v":0},"kg","galvaníserað stál",null,null,null,null,{"$f":"IFERROR(P77*EF_galvst_staur,\"Veldu fjöldaljóskera\")","v":0},{"$f":"P77/1000*N77*EF_fl_s+P77/1000*O77*EF_fl_i","v":0},null,0,{"$f":"Z77*(_xlfn.CEILING.MATH(Forsíða!$D$8/ET_ljstaur)-1)","v":0},0]
[null,null,null,null,null,null,null,null,"Stál","Ljósastaur, ljósker","Öryggisbúnaður og frágangur","76.45 Ljósastuarar",null,2800,20,{"$f":"IFERROR(F77*D77,\"Ath.  innslátt\")","v":"Ath.  innslátt"},"stk","ljósker",null,null,null,null,{"$f":"IFERROR(P78*EF_ljosker,\"Ath innslátt\")","v":"Ath innslátt"},{"$f":"IFERROR(P78*mpst_ljosker/1000*N78*EF_fl_s+P78*mpst_ljosker/1000*O78*EF_fl_i,\"Ath innslátt\")","v":"Ath innslátt"},null,0,{"$f":"Z78*(_xlfn.CEILING.MATH(Forsíða!$D$8/ET_ljosker)-1)","v":0},0]
[null,null,"Ljósastaur 5 m","Veldu fjölda ljóskera","ljósker á staur",0,"stk",null,"Stál","Ljósastaur, Galvaníserað stál","Öryggisbúnaður og frágangur","76.45 Ljósastuarar",null,2800,20,{"$f":"F79*mpst_ljos_5","v":0},"kg","galvaníserað stál",null,null,null,null,{"$f":"IFERROR(P79*EF_galvst_staur,\"Veldu fjöldaljóskera\")","v":0},{"$f":"P79/1000*N79*EF_fl_s+P79/1000*O79*EF_fl_i","v":0},null,0,{"$f":"Z79*(_xlfn.CEILING.MATH(Forsíða!$D$8/ET_ljstaur)-1)","v":0},0]
[null,null,null,null,null,null,null,null,"Stál","Ljósastaur, ljósker","Öryggisbúnaður og frágangur","76.45 Ljósastuarar",null,2800,20,{"$f":"IFERROR(F79*D79,\"Ath. innslátt\")","v":"Ath. innslátt"},"stk","ljósker",null,null,null,null,{"$f":"IFERROR(P80*EF_ljosker,\"Ath innslátt\")","v":"Ath innslátt"},{"$f":"IFERROR(P80*mpst_ljosker/1000*N80*EF_fl_s+P80*mpst_ljosker/1000*O80*EF_fl_i,\"Ath innslátt\")","v":"Ath innslátt"},null,0,{"$f":"Z80*(_xlfn.CEILING.MATH(Forsíða!$D$8/ET_ljosker)-1)","v":0},0]
[null,null,"Ljósastaur 6,3 m","Veldu fjölda ljóskera","ljósker á staur",0,"stk",null,"Stál","Ljósastaur, Galvaníserað stál","Öryggisbúnaður og frágangur","76.45 Ljósastuarar",null,2800,20,{"$f":"F81*mpst_ljos_6","v":0},"kg","galvaníserað stál",null,null,null,null,{"$f":"IFERROR(P81*EF_galvst_staur,\"Veldu fjöldaljóskera\")","v":0},{"$f":"P81/1000*N81*EF_fl_s+P81/1000*O81*EF_fl_i","v":0},null,0,{"$f":"Z81*(_xlfn.CEILING.MATH(Forsíða!$D$8/ET_ljstaur)-1)","v":0},0]
[null,null,null,null,null,null,null,null,"Stál","Ljósastaur, ljósker","Öryggisbúnaður og frágangur","76.45 Ljósastuarar",null,2800,20,{"$f":"IFERROR(F81*D81,\"Ath. innslátt\")","v":"Ath. innslátt"},"stk","ljósker",null,null,null,null,{"$f":"IFERROR(P82*EF_ljosker,\"Ath innslátt\")","v":"Ath innslátt"},{"$f":"IFERROR(P82*mpst_ljosker/1000*N82*EF_fl_s+P82*mpst_ljosker/1000*O82*EF_fl_i,\"Ath innslátt\")","v":"Ath innslátt"},null,0,{"$f":"Z82*(_xlfn.CEILING.MATH(Forsíða!$D$8/ET_ljosker)-1)","v":0},0]
[null,null,"Ljósastaur 8 m","Veldu fjölda ljóskera","ljósker á staur",0,"stk",null,"Stál","Ljósastaur, Galvaníserað stál","Öryggisbúnaður og frágangur","76.45 Ljósastuarar",null,2800,20,{"$f":"F83*mpst_ljos_8","v":0},"kg","galvaníserað stál",null,null,null,null,{"$f":"IFERROR(P83*EF_galvst_staur,\"Veldu fjöldaljóskera\")","v":0},{"$f":"P83/1000*N83*EF_fl_s+P83/1000*O83*EF_fl_i","v":0},null,{"$f":"SUM(W83:Y83)","v":0},{"$f":"Z83*(_xlfn.CEILING.MATH(Forsíða!$D$8/ET_ljstaur)-1)","v":0},0]
[null,null,null,null,null,null,null,null,"Stál","Ljósastaur, ljósker","Öryggisbúnaður og frágangur","76.45 Ljósastuarar",null,2800,20,{"$f":"IFERROR(F83*D83,\"Ath. innslátt\")","v":"Ath. innslátt"},"stk","ljósker",null,null,null,null,{"$f":"IFERROR(P84*EF_ljosker,\"Ath innslátt\")","v":"Ath innslátt"},{"$f":"IFERROR(P84*mpst_ljosker/1000*N84*EF_fl_s+P84*mpst_ljosker/1000*O84*EF_fl_i,\"Ath innslátt\")","v":"Ath innslátt"},null,0,{"$f":"Z84*(_xlfn.CEILING.MATH(Forsíða!$D$8/ET_ljosker)-1)","v":0},0]
[null,null,"Ljósastaur 10 m","Veldu fjölda ljóskera","ljósker á staur",0,"stk",null,"Stál","Ljósastaur, Galvaníserað stál","Öryggisbúnaður og frágangur","76.45 Ljósastuarar",null,2800,20,{"$f":"F85*mpst_ljos_10","v":0},"kg","galvaníserað stál",null,null,null,null,{"$f":"IFERROR(P85*EF_galvst_staur,\"Veldu fjöldaljóskera\")","v":0},{"$f":"P85/1000*N85*EF_fl_s+P85/1000*O85*EF_fl_i","v":0},null,{"$f":"SUM(W85:Y85)","v":0},{"$f":"Z85*(_xlfn.CEILING.MATH(Forsíða!$D$8/ET_ljstaur)-1)","v":0},0]
[null,null,null,null,null,null,null,null,"Stál","Ljósastaur, ljósker","Öryggisbúnaður og frágangur","76.45 Ljósastuarar",null,2800,20,{"$f":"IFERROR(F85*D85,\"Ath. innslátt\")","v":"Ath. innslátt"},"stk","ljósker",null,null,null,null,{"$f":"IFERROR(P86*EF_ljosker,\"Ath innslátt\")","v":"Ath innslátt"},{"$f":"IFERROR(P86*mpst_ljosker/1000*N86*EF_fl_s+P86*mpst_ljosker/1000*O86*EF_fl_i,\"Ath innslátt\")","v":"Ath innslátt"},null,0,{"$f":"Z86*(_xlfn.CEILING.MATH(Forsíða!$D$8/ET_ljosker)-1)","v":0},0]
["75.62",null,"Vegrið á brú",null,null,0,"m",null,"Stál","Vegrið, galvaníserað stál","Öryggisbúnaður og frágangur","75.62 Vegrið á brú",null,2800,20,{"$f":"F87*mpl_rvegr_bru","v":0},"kg","galvaníserað stál",null,null,null,null,{"$f":"P87*EF_galvst_vegr","v":0},{"$f":"P87/1000*N87*EF_fl_s+P87/1000*O87*EF_fl_i","v":0},null,{"$f":"SUM(W87:Y87)","v":0},{"$f":"Z87*(_xlfn.CEILING.MATH(Forsíða!$D$8/ET_vegr_bru)-1)","v":0},0]
["75.7",null,"Handrið",null,null,0,"m",null,"Stál","Handrið, ryðfrítt stál","Öryggisbúnaður og frágangur","75.7 Handrið",null,2800,20,{"$f":"F88*mpL_handr","v":0},"kg","Ryðfrítt stál",null,null,null,null,{"$f":"P88*EF_St_bru_rf","v":0},{"$f":"P88/1000*N88*EF_fl_s+P88/1000*O88*EF_fl_i","v":0},null,0,null,0]
[null,null,null,null,null,null,null,null,null,null,null,null,null,null,null,null,null,"Heildarolíunotkun [L]",{"$f":"SUM(S63:S88)","v":0},"Öryggisbúnaður og frágangur samtals",null,null,{"$f":"SUM(W63:W88)","v":0},0,0,0,0,0]
["Brýr og steypt mannvirki"]
["81.1",null,"Gröftur",null,null,0,"m3 ",null,"Jarðvinna","Jarðvinna, fláafleygar","Skeringar og undirbygging","34.1 Fláafleygar, efni úr skeringum",null,0,20,null,null,null,{"$f":"F91*(Oil_veg+Oil_grafa+Oil_yta)","v":0},null,null,null,null,{"$f":"F91/1000*N91*EF_fl_s+F91/1000*O91*EF_fl_mi","v":0},{"$f":"S91*EF_oil","v":0},{"$f":"SUM(W91:Y91)","v":0},null,{"$f":"SUM(Z91:AA91)","v":0}]
["81.31",null,"Fylling við steypt mannvirki",null,null,0,"m3",null,"Jarðvinna","Jarðvinna, styrktarlag","Brýr og steypt mannvirki","81.31 Fylling við steypt mannvirki","Þjappað styrktarlagsefni",0,10,null,null,null,{"$f":"F92*(Oil_vin+Oil_grafa+Oil_yta+Oil_valt)","v":0},null,null,null,null,{"$f":"F92*mpV_fb/CF_þ_f*N92*EF_fl_s+F92*mpV_fb/CF_þ_f*O92*EF_fl_mi","v":0},{"$f":"S92*EF_oil","v":0},{"$f":"SUM(W92:Y92)","v":0},null,{"$f":"SUM(Z92:AA92)","v":0}]
["83.11",null,"Bergboltar",null,null,0,"stk",null,"Stál","Kambstál, bergboltar","Brýr og steypt mannvirki","83.11 Bergboltar",null,2800,20,{"$f":"F93*mpst_bergb_bru","v":0},"kg","Bergboltar úr kambstáli",null,null,null,null,{"$f":"P93*EF_bergb","v":0},{"$f":"P93/1000*N93*EF_fl_s+P93/1000*O93*EF_fl_i","v":0},null,{"$f":"SUM(W93:Y93)","v":0},null,{"$f":"SUM(Z93:AA93)","v":0}]
[83212,null,"Steyptir staurar"]
[null,null,"Steypa",null,null,0,"m3 ",null,"Steypa","Steypa, steyptir staurar í brú","Brýr og steypt mannvirki","83.212 Steyptir staurar",null,0,20,{"$f":"F95","v":0},"m3","Steypa",null,null,null,null,{"$f":"P95*EF_st_35","v":0},{"$f":"P95*mpV_steypa/1000*N95*EF_fl_s+P95*mpV_steypa/1000*O95*EF_fl_i","v":0},null,{"$f":"SUM(W95:Y95)","v":0},null,{"$f":"SUM(Z95:AA95)","v":0}]
[null,null,"Járnalögn",null,null,0,"kg",null,"Stál","Kambstál, steyptir staurar í brú","Brýr og steypt mannvirki","83.212 Steyptir staurar",null,2800,20,{"$f":"F96","v":0},"kg","kambstál",null,null,null,null,{"$f":"P96*EF_kamb","v":0},{"$f":"P96/1000*N96*EF_fl_s+P96/1000*O96*EF_fl_i","v":0},null,0,null,0]
[83222,null,"Tréstaurar",null,null,0,"m3 ",null,"Timbur","Timbur, tréstaurar í brú","Brýr og steypt mannvirki","83.222 Tréstaurar",null,2800,20,{"$f":"F97","v":0},"m3","Timbur",null,null,null,null,{"$f":"P97*EF_timbur","v":0},{"$f":"P97*mpV_timbur/1000*N97*EF_fl_s+P97*mpV_timbur/1000*O97*EF_fl_i","v":0},null,0,null,0]
[83232,null,"Stálstaurar"]
[null,null,"Stálrör tómt",null,null,0,"kg",null,"Stál","Stál, stálstaurar í brú","Brýr og steypt mannvirki","83.232 Stálstaurar",null,2800,20,{"$f":"F99","v":0},"kg","Stál",null,null,null,null,{"$f":"F99*EF_St_bru","v":0},{"$f":"P99/1000*N99*EF_fl_s+P99/1000*O99*EF_fl_i","v":0},null,0,null,0]
[null,null,"Steypa",null,null,0,"m3",null,"Steypa","Steypa, stálstaurar í brú","Brýr og steypt mannvirki","83.232 Stálstaurar",null,0,20,{"$f":"F100","v":0},"m3","Steypa",null,null,null,null,{"$f":"P100*EF_st_35","v":0},{"$f":"P100*mpV_steypa/1000*N100*EF_fl_s+P100*mpV_steypa/1000*O100*EF_fl_i","v":0},null,0,null,0]
[null,null,"Járnalögn ",null,null,0,"kg",null,"Stál","Kambstál, stálstaurar í brú","Brýr og steypt mannvirki","83.232 Stálstaurar",null,2800,20,{"$f":"F101","v":0},"kg","kambstál",null,null,null,null,{"$f":"P101*EF_kamb","v":0},{"$f":"P101/1000*N101*EF_fl_s+P101/1000*O101*EF_fl_i","v":0},null,0,null,0]
["83.6",null,"Stálþil, efni","Varanlegt",null,0,"m2",null,"Stál","Stál, stálþil","Brýr og steypt mannvirki","83.6 Stálþil",null,2800,20,{"$f":"F102*mpA_stalthil","v":0},"kg","stálþil",null,null,null,null,{"$f":"IF(D102=\"Varanlegt\",P102*EF_stalthil,P102*EF_stalthil/3)","v":0},{"$f":"P102/1000*N102*EF_fl_s+P102/1000*O102*EF_fl_i","v":0},null,0,null,0]
["84.2",null,"Mót",null,null,0,"m2",null,"Timbur","Timbur, mót","Brýr og steypt mannvirki","84.2 Mót",null,2800,20,{"$f":"F103*d_mot","v":0},"m3","Byggingatimbur",null,null,null,null,{"$f":"P103*EF_timbur","v":0},{"$f":"P103*mpV_timbur/1000*N103*EF_fl_s+P103*mpV_timbur/1000*O103*EF_fl_i","v":0},null,0,null,0]
["84.31",null,"Slakbent járnalögn ",null,null,0,"kg",null,"Stál","Kambstál, járnalögn í brú","Brýr og steypt mannvirki","84.31 Slakbent járnalögn",null,2800,20,{"$f":"F104","v":0},"kg","Kambstál",null,null,null,null,{"$f":"P104*EF_kamb","v":0},{"$f":"P104/1000*N104*EF_fl_s+P104/1000*O104*EF_fl_i","v":0},null,0,null,0]
["84.36",null,"Eftirspennt járnalögn",null,null,0,"kg",null,"Stál","Kambstál, járnalögn í brú","Brýr og steypt mannvirki","84.36 Eftirspennt járnalögn",null,280,20,{"$f":"F105","v":0},"kg","Eftirspennukaplar",null,null,null,null,{"$f":"P105*EF_eft_jarn","v":0},{"$f":"P105/1000*N105*EF_fl_s+P105/1000*O105*EF_fl_i","v":0},null,0,null,0]
["84.4",null,"Steypa"]
[null,null,"Steypa C45/C55",null,null,0,"m3 ",null,"Steypa","Steypa, brú","Brýr og steypt mannvirki","84.4 Steypa",null,0,20,{"$f":"F107","v":0},"m3","Steypa",null,null,null,null,{"$f":"P107*EF_st_45","v":0},{"$f":"P107*mpV_steypa/1000*N107*EF_fl_s+P107*mpV_steypa/1000*O107*EF_fl_i","v":0},null,0,null,0]
[null,null,"Steypa C35/C45",null,null,0,"m3",null,"Steypa","Steypa, brú","Brýr og steypt mannvirki","84.4 Steypa",null,0,20,{"$f":"F108","v":0},"m3","Steypa",null,null,null,null,{"$f":"P108*EF_st_35","v":0},{"$f":"P108*mpV_steypa/1000*N108*EF_fl_s+P108*mpV_steypa/1000*O108*EF_fl_i","v":0},null,0,null,0]
[null,null,"Steypa C30/C37",null,null,0,"m3 ",null,"Steypa","Steypa, brú","Brýr og steypt mannvirki","84.4 Steypa",null,0,20,{"$f":"F109","v":0},"m3","Steypa",null,null,null,null,{"$f":"P109*EF_st_30","v":0},{"$f":"P109*mpV_steypa/1000*N109*EF_fl_s+P109*mpV_steypa/1000*O109*EF_fl_i","v":0},null,0,null,0]
["84.57",null,"Vatnsvarnarlag undir malbik",null,null,0,"m2",null,"Annað","Vatnsvarnarlag","Brýr og steypt mannvirki","84.57 Vatnsvarnalag undir malbiki",null,2800,20,{"$f":"F110*mpA_vatnsv","v":0},"kg","Vatnsvarnarlag",null,null,null,null,{"$f":"P110*EF_vatnsv","v":0},{"$f":"P110/1000*N110*EF_fl_s+P110/1000*O110*EF_fl_i","v":0},null,0,null,0]
["85.1",null,"Stálvirki, smíði"]
[null,null,"Stálvirki, smíði, óryðfrítt",null,null,0,"tonn",null,"Stál","Stál, brú","Brýr og steypt mannvirki","85.1 Stálvirki",null,2800,20,{"$f":"F112","v":0},"tonn","Stál",null,null,null,null,{"$f":"P112*1000*EF_St_bru","v":0},{"$f":"P112*N112*EF_fl_s+P112*O112*EF_fl_i","v":0},null,0,null,0]
[null,null,"Stálvirki, smíði, ryðfrítt",null,null,0,"tonn",null,"Stál","Ryðfrítt stál, brú","Brýr og steypt mannvirki","85.1 Stálvirki",null,2800,20,{"$f":"F113","v":0},"tonn","Ryðfrítt stál",null,null,null,null,{"$f":"P113*1000*EF_St_bru_rf","v":0},{"$f":"P113*N113*EF_fl_s+P113*O113*EF_fl_i","v":0},null,0,null,0]
["86.1",null,"Legur"]
[null,null,"Lóðrétt álag <300 tonn",null,null,0,"stk",null,"Gúmmí","Gúmmí, legur","Brýr og steypt mannvirki","86.1 Legur",null,2800,20,{"$f":"F115*mpst_legur_S","v":0},"kg","Gúmmí",null,null,null,null,{"$f":"P115*EF_gummi","v":0},{"$f":"P115/1000*N115*EF_fl_s+P115/1000*O115*EF_fl_i","v":0},null,0,{"$f":"Z115*(_xlfn.CEILING.MATH(Forsíða!$D$8/ET_legur)-1)","v":0},0]
[null,null,"Lóðrétt álag >300 tonn",null,null,0,"stk",null,"Gúmmí","Gúmmí, legur","Brýr og steypt mannvirki","86.1 Legur",null,2800,20,{"$f":"F116*mpst_legur_L","v":0},"kg","Gúmmí",null,null,null,null,{"$f":"P116*EF_gummi","v":0},{"$f":"P116/1000*N116*EF_fl_s+P116/1000*O116*EF_fl_i","v":0},null,0,{"$f":"Z116*(_xlfn.CEILING.MATH(Forsíða!$D$8/ET_legur)-1)","v":0},0]
["86.4",null,"Þensluraufar",null,null,0,"m",null,"Stál","Stál, þensluraufar","Brýr og steypt mannvirki","86.4 Þensluraufar",null,2800,20,{"$f":"F117*mpL_stal_rauf","v":0},"kg","Stál",null,null,null,null,{"$f":"P117*EF_St_bru","v":0},{"$f":"P117/1000*N117*EF_fl_s+P117/1000*O117*EF_fl_i","v":0},null,{"$f":"SUM(W117:Y117)","v":0},{"$f":"Z117*(_xlfn.CEILING.MATH(Forsíða!$D$8/ET_thraufar)-1)","v":0},0]
[null,null,null,null,null,null,null,null,"Gúmmí","Gúmmí, þensluraufar","Brýr og steypt mannvirki","86.4 Þensluraufar",null,2800,20,{"$f":"F117*mpL_gummi_rauf","v":0},"kg","Gúmmí",null,null,null,null,{"$f":"P118*EF_gummi","v":0},{"$f":"P118/1000*N118*EF_fl_s+P118/1000*O118*EF_fl_i","v":0},null,{"$f":"SUM(W118:Y118)","v":0},{"$f":"Z118*(_xlfn.CEILING.MATH(Forsíða!$D$8/ET_thraufar)-1)","v":0},0]
[null,null,null,null,null,null,null,null,null,null,null,null,null,null,null,null,null,"Heildarolíunotkun [L]",{"$f":"SUM(S91:S118)","v":0},"Brýr og steypt mannvirki samtals",null,null,{"$f":"SUM(W91:W118)","v":0},{"$f":"SUM(X91:X118)","v":0},0,0,0,{"$f":"SUM(AB91:AB118)","v":0}]
[]
[null,null,null,null,null,null,null,null,null,null,null,null,null,null,null,"Heildarolíunotkun framkvæmdar",null,null,{"$f":"SUM(,S119,S89,S61,S48,S17)","v":0},"Öll framkvæmd samtals",null,null,{"$f":"SUM(W119,W89,W61,W48,W17)","v":0},0,0,0,0,0]

{"sheet":"Innsláttur - Jarðgöng","index":5,"n_rows":172,"n_cols":28,"rows_kept":172,"cut":false,"hidden":false,"merged":[[7,0,7,1],[7,2,7,4],[8,2,8,4],[9,2,9,4],[10,0,10,1],[10,2,10,4],[1,19,1,21],[1,22,1,27],[5,0,5,1],[5,2,5,4],[6,0,6,1],[6,2,6,4],[1,10,2,10],[1,11,2,11],[1,12,2,12],[1,15,2,15],[1,16,2,16],[1,17,2,17],[1,0,2,1],[1,2,2,4],[1,5,2,5],[1,6,2,6],[1,8,2,8],[16,19,16,21],[18,0,18,1],[18,2,18,4],[19,2,19,4],[11,2,11,4],[12,2,12,4],[13,0,13,1],[13,2,13,4],[14,0,14,1],[14,2,14,4],[32,2,32,4],[33,2,33,4],[34,2,34,4],[35,2,35,4],[36,2,36,4],[37,2,37,4],[1,9,2,9],[26,2,26,4],[27,2,27,4],[28,2,28,4],[29,2,29,4],[30,2,30,4],[31,2,31,4],[20,2,20,4],[21,2,21,4],[22,2,22,4],[23,2,23,4],[24,2,24,4],[25,2,25,4],[44,2,44,4],[45,2,45,4],[46,2,46,4],[47,2,47,4],[48,2,48,4],[49,2,49,4],[38,2,38,4],[39,2,39,4],[40,2,40,4],[41,2,41,4],[42,2,42,4],[43,2,43,4],[56,2,56,4],[57,2,57,4],[58,2,58,4],[59,2,59,4],[60,2,62,4],[60,5,62,5],[50,2,50,4],[51,2,51,4],[52,2,52,4],[53,2,53,4],[54,2,54,4],[55,2,55,4],[66,2,68,4],[66,5,68,5],[66,6,68,6],[66,12,68,12],[69,2,71,4],[69,5,71,5],[69,6,71,6],[69,12,71,12],[60,6,62,6],[60,12,62,12],[63,2,65,4],[63,5,65,5],[63,6,65,6],[63,12,65,12],[86,2,86,4],[87,2,87,4],[87,19,87,21],[81,2,81,4],[82,2,82,4],[83,2,83,4],[84,2,84,4],[85,2,85,4],[72,2,72,4],[73,2,73,4],[74,2,74,4],[75,2,75,4],[79,19,79,21],[102,0,102,1],[102,2,102,4],[103,2,104,4],[103,5,104,5],[100,19,100,21],[91,0,91,1],[92,0,92,1],[92,2,92,4],[96,0,96,1],[96,2,96,4],[97,0,97,1],[97,2,97,4],[107,12,108,12],[109,0,109,1],[109,2,109,4],[103,6,104,6],[103,12,104,12],[105,2,106,4],[105,5,106,5],[105,6,106,6],[105,12,106,12],[110,0,110,1],[110,2,110,4],[111,0,111,1],[111,2,111,4],[112,0,112,1],[112,2,112,4],[107,2,108,4],[107,5,108,5],[107,6,108,6],[116,5,117,5],[116,6,117,6],[118,2,119,2],[118,3,119,3],[118,4,119,4],[118,5,119,5],[118,6,119,6],[113,0,113,1],[113,2,113,4],[114,0,114,1],[115,0,115,1],[115,2,115,4],[116,2,117,2],[116,3,117,3],[116,4,117,4],[120,2,121,2],[120,3,121,3],[120,4,121,4],[120,5,121,5],[120,6,121,6],[122,2,123,2],[122,3,123,3],[122,4,123,4],[122,5,123,5],[122,6,123,6],[127,2,127,4],[128,19,128,21],[124,2,125,2],[124,3,125,3],[124,4,125,4],[124,5,125,5],[124,6,125,6],[126,0,126,1],[126,2,126,4],[146,2,146,4],[149,0,149,1],[149,2,149,4],[150,0,150,1],[150,2,150,4],[132,2,132,4],[133,0,133,1],[133,2,133,4],[134,0,134,1],[134,2,134,4],[169,19,169,21],[171,15,171,17],[171,19,171,21],[176,18,176,21],[130,2,130,4],[158,0,158,1],[164,0,164,1],[165,0,165,1],[166,0,166,1],[168,0,168,1],[130,0,130,1],[142,0,142,1],[142,2,142,4],[135,0,135,1],[135,2,135,4],[136,2,136,4],[137,0,137,1],[137,2,137,4],[138,0,138,1],[138,2,138,4],[131,0,131,1],[131,2,131,4],[143,0,143,1],[143,2,143,4],[157,0,157,27],[129,0,129,27],[101,0,101,27],[90,0,90,27],[80,0,80,27],[17,0,17,27],[4,0,4,27],[15,0,15,1],[15,2,15,4],[144,0,144,1],[144,2,144,4],[145,0,145,1],[145,2,145,4],[139,0,139,1],[140,0,140,1],[140,2,140,4],[141,0,141,1],[141,2,141,4],[154,0,155,1],[154,2,155,4],[154,5,155,5],[154,6,155,6],[156,19,156,21],[146,0,146,1]]}
[]
["Númer verkþáttar",null,"Heiti verkþáttar",null,null,"Magn","Eining",null,"Flokkur, gróft","Flokkur, ítarlegt","Yfirverkþáttur","Undirverkþáttur","Efni","Flutningsvegalengd [km]",null,"Magn","Eining","Efni","Olíunotkun [L]","Önnur efnisnotkun",null,null,"Losun (kg CO2-íg.)"]
[null,null,null,null,null,null,null,null,null,null,null,null,null,"Á sjó","Innanlands",null,null,null,"Magn","Magn","Eining","Skýring","A1-A3","A4","A5","A1-A5","B4","A1-A5 + B4"]
[]
["Skeringar og undirbygging"]
["32.1",null,"Bergskeringar í vegstæði",null,null,0,"m3 ",null,"Jarðvinna","Jarðvinna, bergskeringar","Skeringar og undirbygging","32.1 Bergskeringar í vegstæði","Fast berg",2800,20,{"$f":"F6*spr_fb","v":0},"kg","Sprengiefni",{"$f":"F6*Oil_bor","v":0},{"$f":"P6","v":0},"kg","Sprengiefni",{"$f":"P6*EF_spr","v":0},{"$f":"P6/1000*N6*EF_fl_s+P6/1000*O6*EF_fl_i","v":0},{"$f":"S6*EF_oil+T6*EF_spr","v":0},{"$f":"SUM(W6:Y6)","v":0},null,{"$f":"SUM(Z6:AA6)","v":0}]
["32.2",null,"Bergskeringar í námu",null,null,0,"m3 ",null,"Jarðvinna","Jarðvinna, bergskeringar","Skeringar og undirbygging","32.2 Bergskeringar í námu","Fast berg",2800,20,{"$f":"F7*spr_fb","v":0},"kg","Sprengiefni",{"$f":"F7*Oil_bor","v":0},{"$f":"P7","v":0},"kg","Sprengiefni",{"$f":"P7*EF_spr","v":0},{"$f":"P7/1000*N7*EF_fl_s+P7/1000*O7*EF_fl_i","v":0},{"$f":"S7*EF_oil+T7*EF_spr","v":0},{"$f":"SUM(W7:Y7)","v":0},null,{"$f":"SUM(Z7:AA7)","v":0}]
["33.1",null,"Fyllingarefni úr skeringum",null,null,null,null,null,null,null,null,null,null,null,null,null,null,null,null,null,null,null,null,null,null,null,null,0]
[null,null,"Þar af laust fyllingarefni",null,null,0,"m3 ",null,"Jarðvinna","Jarðvinna, fyllingarefni","Skeringar og undirbygging","33.1 Fyllingarefni úr skeringum","Þjappað fyllingarefni",0,20,null,null,null,{"$f":"F9*(Oil_veg+Oil_grafa+Oil_yta+Oil_valt)","v":0},null,null,null,null,{"$f":"F9*mpV_fb/CF_þ_f*N9*EF_fl_s+F9*mpV_fb/CF_þ_f*O9*EF_fl_mi","v":0},{"$f":"S9*EF_oil","v":0},0,null,0]
[null,null,"Þar af sprengt fyllingarefni",null,null,0,"m3",null,"Jarðvinna","Jarðvinna, fyllingarefni","Skeringar og undirbygging","33.1 Fyllingarefni úr skeringum","Þjappað fyllingarefni",0,20,null,null,null,{"$f":"F10*(Oil_grafa*2+Oil_yta+Oil_valt)","v":0},null,null,null,null,{"$f":"F10*mpV_fb/CF_þ_f*N10*EF_fl_s+F10*mpV_fb/CF_þ_f*O10*EF_fl_mi","v":0},{"$f":"S10*EF_oil","v":0},0,null,0]
["33.2",null,"Fyllingarefni úr námu",null,null,null,null,null,null,null,null,null,null,null,null,null,null,null,null,null,null,null,null,null,null,null,null,0]
[null,null,"Laust fyllingarefni",null,null,0,"m3",null,"Jarðvinna","Jarðvinna, fyllingarefni","Skeringar og undirbygging","33.2 Fyllingarefni úr námu","Þjappað fyllingarefni",0,20,null,null,null,{"$f":"F12*(Oil_grafa*2+Oil_yta+Oil_valt)","v":0},null,null,null,null,{"$f":"F12*mpV_fb/CF_þ_f*N12*EF_fl_s+F12*mpV_fb/CF_þ_f*O12*EF_fl_mi","v":0},{"$f":"S12*EF_oil","v":0},0,null,0]
[null,null,"Sprengt fyllingarefni",null,null,0,"m3",null,"Jarðvinna","Jarðvinna, fyllingarefni","Skeringar og undirbygging","33.2 Fyllingarefni úr námu","Þjappað fyllingarefni",0,20,null,null,null,{"$f":"F13*(Oil_grafa*2+Oil_yta+Oil_valt)","v":0},null,null,null,null,{"$f":"F13*mpV_fb/CF_þ_f*N13*EF_fl_s+F13*mpV_fb/CF_þ_f*O13*EF_fl_mi","v":0},{"$f":"S13*EF_oil","v":0},0,null,0]
["34.1",null,"Fláafleygar, efni úr skeringum",null,null,0,"m3",null,"Jarðvinna","Jarðvinna, fláafleygar","Skeringar og undirbygging","34.1 Fláafleygar, efni úr skeringum",null,0,20,null,null,null,{"$f":"F14*(Oil_veg+Oil_grafa+Oil_yta)","v":0},null,null,null,null,{"$f":"F14/1000*N14*EF_fl_s+F14/1000*O14*EF_fl_mi","v":0},{"$f":"S14*EF_oil","v":0},0,null,0]
["34.8",null,"Ónothæfu efni jafnað á losunarstað",null,null,0,"m3",null,"Jarðvinna","Jarðvinna, ónothæft efni","Skeringar og undirbygging","34.8 Ónothæfu efni jafnað á losunarstað",null,0,20,null,null,null,{"$f":"F15*(Oil_veg+Oil_yta)","v":0},null,null,null,null,{"$f":"F15/1000*N15*EF_fl_s+F15/1000*O15*EF_fl_mi","v":0},{"$f":"S15*EF_oil","v":0},0,null,0]
["36.2",null,"Grjótvörn",null,null,0,"m3",null,"Jarðvinna","Jarðvinna, grjótvörn","Skeringar og undirbygging","36.2 Grjótvörn",null,0,20,{"$f":"F16","v":0},"m3","grjót >2 tonn",{"$f":"F16*Oil_grjot","v":0},null,null,null,{"$f":"P16*EF_grjot","v":0},{"$f":"F16*mpV_grjot*N16*EF_fl_s+F16*mpV_grjot*O16*EF_fl_mi","v":0},{"$f":"S16*EF_oil","v":0},0,null,0]
[null,null,null,null,null,null,null,null,null,null,null,null,null,null,null,null,null,"Heildarolíunotkun [L]",{"$f":"SUM(S6:S16)","v":0},"Skeringar og undirbygging samtals",null,null,{"$f":"SUM(W6:W16)","v":0},0,0,0,0,0]
["Ræsi og veitur"]
["45.71",null,"Plaströr, vatnsveita"]
[null,null,"Vatnsveiturör, D = 63 - 200 mm",null,null,0,"m",null,"Plast","Plast, Vatnsveiturör","Ræsi og veitur","45.71 Plaströr, vatnsveita","Plaströr",2800,20,{"$f":"F20*mpl_VVror_02","v":0},"kg","Plast, PE",null,null,null,null,{"$f":"P20*EF_VV_PE","v":0},{"$f":"P20/1000*N20*EF_fl_s+P20/1000*O20*EF_fl_i","v":0},null,{"$f":"SUM(W20:Y20)","v":0},null,{"$f":"SUM(Z20:AA20)","v":0}]
[null,null,"Vatnsveiturör, D = 201 - 400  mm",null,null,0,"m",null,"Plast","Plast, Vatnsveiturör","Ræsi og veitur","45.71 Plaströr, vatnsveita","Plaströr",2800,20,{"$f":"F21*mpl_VVror_04","v":0},"kg","Plast, PE",null,null,null,null,0,0,null,0,null,0]
[null,null,"Vatnsveiturör, D = 401 - 600  mm",null,null,0,"m",null,"Plast","Plast, Vatnsveiturör","Ræsi og veitur","45.71 Plaströr, vatnsveita","Plaströr",2800,20,{"$f":"F22*mpl_VVror_06","v":0},"kg","Plast, PE",null,null,null,null,0,0,null,0,null,0]
[null,null,"Vatnsveiturör, D = 601 - 800  mm",null,null,0,"m",null,"Plast","Plast, Vatnsveiturör","Ræsi og veitur","45.71 Plaströr, vatnsveita","Plaströr",2800,20,{"$f":"F23*mpl_VVror_08","v":0},"kg","Plast, PE",null,null,null,null,0,0,null,0,null,0]
[null,null,"Vatnsveiturör, D = 801 - 1000  mm",null,null,0,"m",null,"Plast","Plast, Vatnsveiturör","Ræsi og veitur","45.71 Plaströr, vatnsveita","Plaströr",2800,20,{"$f":"F24*mpl_VVror_10","v":0},"kg","Plast, PE",null,null,null,null,0,0,null,0,null,0]
[null,null,"Vatnsveiturör, D = 1001 - 1200  mm",null,null,0,"m",null,"Plast","Plast, Vatnsveiturör","Ræsi og veitur","45.71 Plaströr, vatnsveita","Plaströr",2800,20,{"$f":"F25*mpl_VVror_12","v":0},"kg","Plast, PE",null,null,null,null,0,0,null,0,null,0]
["42.3",null,"Plaströr, fráveita"]
[null,null,"Fráveiturör, D = 250 - 400 mm",null,null,0,"m",null,"Plast","Plast, fráveiturör","Ræsi og veitur","42.3 Plaströr, fráveita","Plaströr",2800,20,{"$f":"F27*mpl_FVror_04","v":0},"kg","Plast, X-Stream",null,null,null,null,{"$f":"P27*EF_FV_Xstr","v":0},{"$f":"P27/1000*N27*EF_fl_s+P27/1000*O27*EF_fl_i","v":0},null,{"$f":"SUM(W27:Y27)","v":0},null,0]
[null,null,"Fráveiturör, D = 401 - 600 mm",null,null,0,"m",null,"Plast","Plast, fráveiturör","Ræsi og veitur","42.3 Plaströr, fráveita","Plaströr",2800,20,{"$f":"F28*mpl_FVror_06","v":0},"kg","Plast, X-Stream",null,null,null,null,{"$f":"P28*EF_FV_Xstr","v":0},0,null,0,null,0]
[null,null,"Fráveiturör, D = 601 - 800 mm",null,null,0,"m",null,"Plast","Plast, fráveiturör","Ræsi og veitur","42.3 Plaströr, fráveita","Plaströr",2800,20,{"$f":"F29*mpl_FVror_08","v":0},"kg","Plast, X-Stream",null,null,null,null,{"$f":"P29*EF_FV_Xstr","v":0},0,null,0,null,0]
[null,null,"Fráveiturör, D = 801 - 1000 mm",null,null,0,"m",null,"Plast","Plast, fráveiturör","Ræsi og veitur","42.3 Plaströr, fráveita","Plaströr",2800,20,{"$f":"F30*mpl_FVror_10","v":0},"kg","Plast, Weholite",null,null,null,null,{"$f":"P30*EF_FV_Weh","v":0},0,null,0,null,0]
[null,null,"Fráveiturör, D = 1001 - 1400 mm",null,null,0,"m",null,"Plast","Plast, fráveiturör","Ræsi og veitur","42.3 Plaströr, fráveita","Plaströr",2800,20,{"$f":"F31*mpl_FVror_14","v":0},"kg","Plast, Weholite",null,null,null,null,{"$f":"P31*EF_FV_Weh","v":0},0,null,0,null,0]
[null,null,"Fráveiturör, D = 1401 - 1800 mm",null,null,0,"m",null,"Plast","Plast, fráveiturör","Ræsi og veitur","42.3 Plaströr, fráveita","Plaströr",2800,20,{"$f":"F32*mpl_FVror_18","v":0},"kg","Plast, Weholite",null,null,null,null,{"$f":"P32*EF_FV_Weh","v":0},0,null,0,null,0]
[null,null,"Fráveiturör, D = 1801 - 2200 mm",null,null,0,"m",null,"Plast","Plast, fráveiturör","Ræsi og veitur","42.3 Plaströr, fráveita","Plaströr",2800,20,{"$f":"F33*mpl_FVror_22","v":0},"kg","Plast, Weholite",null,null,null,null,{"$f":"P33*EF_FV_Weh","v":0},0,null,0,null,0]
[null,null,"Fráveiturör, D > 2200 mm",null,null,0,"m",null,"Plast","Plast, fráveiturör","Ræsi og veitur","42.3 Plaströr, fráveita","Plaströr",2800,20,{"$f":"F34*mpl_FVror_22p","v":0},"kg","Plast, Weholite",null,null,null,null,{"$f":"P34*EF_FV_Weh","v":0},0,null,0,null,0]
["45.72",null,"Hitaveiturör"]
[null,null,"Hitaveiturör, D = 250 mm",null,null,0,"m",null,"Stál","Stál, hitaveiturör","Ræsi og veitur","45.72 Hitaveiturör","PUR-einangrað stálrör",2800,20,{"$f":"F36","v":0},"m","Einangrað stálrör",null,null,null,null,{"$f":"P36*EF_Hvror_025","v":0},{"$f":"P36/1000*N36*EF_fl_s+P36/1000*O36*EF_fl_i","v":0},null,{"$f":"SUM(W36:Y36)","v":0},null,0]
[null,null,"Hitaveiturör, D = 300 mm",null,null,0,"m",null,"Stál","Stál, hitaveiturör","Ræsi og veitur","45.72 Hitaveiturör","PUR-einangrað stálrör",2800,20,0,"m","Einangrað stálrör",null,null,null,null,{"$f":"P37*EF_Hvror_03","v":0},0,null,0,null,0]
[null,null,"Hitaveiturör, D = 350 mm",null,null,0,"m",null,"Stál","Stál, hitaveiturör","Ræsi og veitur","45.72 Hitaveiturör","PUR-einangrað stálrör",2800,20,0,"m","Einangrað stálrör",null,null,null,null,{"$f":"P38*EF_Hvror_035","v":0},0,null,0,null,0]
[null,null,"Hitaveiturör, D = 400 mm",null,null,0,"m",null,"Stál","Stál, hitaveiturör","Ræsi og veitur","45.72 Hitaveiturör","PUR-einangrað stálrör",2800,20,0,"m","Einangrað stálrör",null,null,null,null,{"$f":"P39*EF_Hvror_04","v":0},0,null,0,null,0]
[null,null,"Hitaveiturör, D = 450 mm",null,null,0,"m",null,"Stál","Stál, hitaveiturör","Ræsi og veitur","45.72 Hitaveiturör","PUR-einangrað stálrör",2800,20,0,"m","Einangrað stálrör",null,null,null,null,{"$f":"P40*EF_Hvror_045","v":0},0,null,0,null,0]
[null,null,"Hitaveiturör, D = 500 mm",null,null,0,"m",null,"Stál","Stál, hitaveiturör","Ræsi og veitur","45.72 Hitaveiturör","PUR-einangrað stálrör",2800,20,0,"m","Einangrað stálrör",null,null,null,null,{"$f":"P41*EF_Hvror_05","v":0},0,null,0,null,0]
[null,null,"Hitaveiturör, D = 600 mm",null,null,0,"m",null,"Stál","Stál, hitaveiturör","Ræsi og veitur","45.72 Hitaveiturör","PUR-einangrað stálrör",2800,20,0,"m","Einangrað stálrör",null,null,null,null,{"$f":"P42*EF_Hvror_06","v":0},0,null,0,null,0]
[null,null,"Hitaveiturör, D = 700 mm",null,null,0,"m",null,"Stál","Stál, hitaveiturör","Ræsi og veitur","45.72 Hitaveiturör","PUR-einangrað stálrör",2800,20,0,"m","Einangrað stálrör",null,null,null,null,{"$f":"P43*EF_Hvror_07","v":0},0,null,0,null,0]
[null,null,"Hitaveiturör, D = 800 mm",null,null,0,"m",null,"Stál","Stál, hitaveiturör","Ræsi og veitur","45.72 Hitaveiturör","PUR-einangrað stálrör",2800,20,0,"m","Einangrað stálrör",null,null,null,null,{"$f":"P44*EF_Hvror_08","v":0},0,null,0,null,0]
["42.4",null,"Stálrör í ræsi"]
[null,42412,"Stálrör, D = 0,3 m",null,null,0,"m",null,"Stál","Stál, ræsi","Ræsi og veitur","42.4 Stálrör í ræsi","Stálrör",2800,20,{"$f":"F46*mpl_Stalror_03","v":0},"kg","Stál",null,null,null,null,{"$f":"P46*EF_Stal_ror","v":0},{"$f":"P46/1000*N46*EF_fl_s+P46/1000*O46*EF_fl_i","v":0},null,{"$f":"SUM(W46:Y46)","v":0},null,0]
[null,42415,"Stálrör, D = 0,6 m",null,null,0,"m",null,"Stál","Stál, ræsi","Ræsi og veitur","42.4 Stálrör í ræsi","Stálrör",2800,20,{"$f":"F47*mpl_Stalror_06","v":0},"kg","Stál",null,null,null,null,0,0,null,0,null,0]
[null,42417,"Stálrör, D = 0,8 m",null,null,0,"m",null,"Stál","Stál, ræsi","Ræsi og veitur","42.4 Stálrör í ræsi","Stálrör",2800,20,{"$f":"F48*mpl_Stalror_08","v":0},"kg","Stál",null,null,null,null,0,0,null,0,null,0]
[null,42422,"Stálrör, D = 1,0 m",null,null,0,"m",null,"Stál","Stál, ræsi","Ræsi og veitur","42.4 Stálrör í ræsi","Stálrör",2800,20,{"$f":"F49*mpl_Stalror_10","v":0},"kg","Stál",null,null,null,null,0,0,null,0,null,0]
[null,42424,"Stálrör, D = 1,2 m",null,null,0,"m",null,"Stál","Stál, ræsi","Ræsi og veitur","42.4 Stálrör í ræsi","Stálrör",2800,20,{"$f":"F50*mpl_Stalror_12","v":0},"kg","Stál",null,null,null,null,0,0,null,0,null,0]
[null,42428,"Stálrör, D = 1,6 m",null,null,0,"m",null,"Stál","Stál, ræsi","Ræsi og veitur","42.4 Stálrör í ræsi","Stálrör",2800,20,{"$f":"F51*mpl_Stalror_16","v":0},"kg","Stál",null,null,null,null,0,0,null,0,null,0]
[null,42432,"Stálrör, D = 2,0 m",null,null,0,"m",null,"Stál","Stál, ræsi","Ræsi og veitur","42.4 Stálrör í ræsi","Stálrör",2800,20,{"$f":"F52*mpl_Stalror_20","v":0},"kg","Stál",null,null,null,null,0,0,null,0,null,0]
[null,42442,"Stálrör, D >= 3,0 m",null,null,0,"m",null,"Stál","Stál, ræsi","Ræsi og veitur","42.4 Stálrör í ræsi","Stálrör",2800,20,{"$f":"F53*mpl_Stalror_30","v":0},"kg","Stál",null,null,null,null,0,0,null,0,null,0]
["45.4",null,"Steypt ofanvatnsræsi"]
[null,"45.41","Steypt ofanvatnsræsi, D < 120 mm",null,null,0,"m",null,"Steypa","Steypa, ofanvatnsræsi","Ræsi og veitur","45.4 Steypt ofanvatnsræsi","Steypt rör",2800,200,{"$f":"F55*mpl_Stror_120","v":0},"kg","Steypt rör",null,null,null,null,{"$f":"P55/mpV_steypa*EF_St_ror","v":0},{"$f":"P55/1000*N55*EF_fl_s+P55/1000*O55*EF_fl_i","v":0},null,{"$f":"SUM(W55:Y55)","v":0},null,0]
[null,"45.42","Steypt ofanvatnsræsi, D = 120 - 300 mm",null,null,0,"m",null,"Steypa","Steypa, ofanvatnsræsi","Ræsi og veitur","45.4 Steypt ofanvatnsræsi","Steypt rör",2800,200,{"$f":"F56*mpl_Stror_300","v":0},"kg","Steypt rör",null,null,null,null,{"$f":"P56/mpV_steypa*EF_St_ror","v":0},{"$f":"P56/1000*N56*EF_fl_s+P56/1000*O56*EF_fl_i","v":0},null,0,null,0]
[null,"45.43","Steypt ofanvatnsræsi, D = 301 - 600 mm",null,null,0,"m",null,"Steypa","Steypa, ofanvatnsræsi","Ræsi og veitur","45.4 Steypt ofanvatnsræsi","Steypt rör",2800,200,{"$f":"F57*mpl_Stror_600","v":0},"kg","Steypt rör",null,null,null,null,{"$f":"P57/mpV_steypa*EF_St_ror","v":0},{"$f":"P57/1000*N57*EF_fl_s+P57/1000*O57*EF_fl_i","v":0},null,0,null,0]
[null,"45.44","Steypt ofanvatnsræsi, D = 601 - 1000 mm",null,null,0,"m",null,"Steypa","Steypa, ofanvatnsræsi","Ræsi og veitur","45.4 Steypt ofanvatnsræsi","Steypt rör",2800,200,{"$f":"F58*mpl_Stror_1000","v":0},"kg","Steypt rör",null,null,null,null,{"$f":"P58/mpV_steypa*EF_St_ror","v":0},{"$f":"P58/1000*N58*EF_fl_s+P58/1000*O58*EF_fl_i","v":0},null,0,null,0]
[null,"45.45","Steypt ofanvatnsræsi, D > 1000 mm",null,null,0,"m",null,"Steypa","Steypa, ofanvatnsræsi","Ræsi og veitur","45.4 Steypt ofanvatnsræsi","Steypt rör",2800,200,{"$f":"F59*mpl_Stror_1000p","v":0},"kg","Steypt rör",null,null,null,null,{"$f":"P59/mpV_steypa*EF_St_ror","v":0},{"$f":"P59/1000*N59*EF_fl_s+P59/1000*O59*EF_fl_i","v":0},null,0,null,0]
["45.5",null,"Brunnar (plastbrunnar með steyptum flotkarmi og stálloki)"]
[null,null,"Brunnur, D = 600 mm, dýpt = 0-2,5 m",null,null,0,"stk",null,"Plast","Plast, brunnur","Ræsi og veitur","45.5 Brunnar","PP brunnur",2800,20,{"$f":"F61*(mpst_Br_06+mpl_BrUp_06*1)","v":0},"kg","Plast, PP",null,null,null,null,{"$f":"P61*EF_PP","v":0},{"$f":"P61/1000*N61*EF_fl_s+P61/1000*O61*EF_fl_i","v":0},null,0,null,{"$f":"SUM(Z61:AA61)","v":0}]
[null,null,null,null,null,null,null,null,"Steypa","Steypa, flotkarmur","Ræsi og veitur","45.5 Brunnar",null,2800,20,{"$f":"F61*mpst_flotk","v":0},"kg","Steyptur flotkarmur",null,null,null,null,{"$f":"P62/mpV_steypa*EF_St_ror","v":0},0,null,0,null,{"$f":"SUM(Z62:AA62)","v":0}]
[null,null,null,null,null,null,null,null,"Stál","Stál, brunnlok","Ræsi og veitur","45.5 Brunnar",null,2800,20,{"$f":"F61*mpst_br_lok","v":0},"kg","Stállok",null,null,null,null,{"$f":"P63*EF_Stal_ror","v":0},0,null,0,null,0]
[null,null,"Brunnur, D = 600 mm, dýpt > 2,5 m",null,null,0,"stk",null,"Plast","Plast, brunnur","Ræsi og veitur","45.5 Brunnar","PP brunnur",2800,20,{"$f":"F64*(mpst_Br_06+mpl_BrUp_06*3)","v":0},"kg","Plast, PP",null,null,null,null,{"$f":"P64*EF_PP","v":0},0,null,0,null,0]
[null,null,null,null,null,null,null,null,"Steypa","Steypa, flotkarmur","Ræsi og veitur","45.5 Brunnar",null,2800,20,{"$f":"F64*mpst_flotk","v":0},"kg","Steyptur flotkarmur",null,null,null,null,{"$f":"P65*EF_St_ror","v":0},0,null,0,null,0]
[null,null,null,null,null,null,null,null,"Stál","Stál, brunnlok","Ræsi og veitur","45.5 Brunnar",null,2800,20,{"$f":"F64*mpst_br_lok","v":0},"kg","Stállok",null,null,null,null,{"$f":"P66*EF_Stal_ror","v":0},0,null,0,null,0]
[null,null,"Brunnur, D = 1000 mm, dýpt = 0-2,5 m",null,null,0,"stk",null,"Plast","Plast, brunnur","Ræsi og veitur","45.5 Brunnar","PP brunnur",2800,20,{"$f":"F67*(mpst_Br_10+mpl_BrUp_10*1)","v":0},"kg","Plast, PP",null,null,null,null,{"$f":"P67*EF_PP","v":0},0,null,0,null,0]
[null,null,null,null,null,null,null,null,"Steypa","Steypa, flotkarmur","Ræsi og veitur","45.5 Brunnar",null,2800,20,{"$f":"F67*mpst_flotk","v":0},"kg","Steyptur flotkarmur",null,null,null,null,{"$f":"P68*EF_St_ror","v":0},0,null,0,null,0]
[null,null,null,null,null,null,null,null,"Stál","Stál, brunnlok","Ræsi og veitur","45.5 Brunnar",null,2800,20,{"$f":"F67*mpst_br_lok","v":0},"kg","Stállok",null,null,null,null,{"$f":"P69*EF_Stal_ror","v":0},0,null,0,null,0]
[null,null,"Brunnur, D = 1000 mm, dýpt > 2,5 m",null,null,0,"stk",null,"Plast","Plast, brunnur","Ræsi og veitur","45.5 Brunnar","PP brunnur",2800,20,{"$f":"F70*(mpst_Br_10+mpl_BrUp_10*3)","v":0},"kg","Plast, PP",null,null,null,null,{"$f":"P70*EF_PP","v":0},0,null,0,null,0]
[null,null,null,null,null,null,null,null,"Steypa","Steypa, flotkarmur","Ræsi og veitur","45.5 Brunnar",null,2800,20,{"$f":"F70*mpst_flotk","v":0},"kg","Steyptur flotkarmur",null,null,null,null,{"$f":"P71*EF_St_ror","v":0},0,null,0,null,0]
[null,null,null,null,null,null,null,null,"Stál","Stál, brunnlok","Ræsi og veitur","45.5 Brunnar",null,2800,20,{"$f":"F70*mpst_br_lok","v":0},"kg","Stállok",null,null,null,null,{"$f":"P72*EF_Stal_ror","v":0},0,null,0,null,0]
["45.6",null,"Niðurföll / sandfang",null,null,0,"stk",null,"Plast","Plast, niðurfall","Ræsi og veitur","45.6 Niðurföll / sandfang","PP niðurfall",2800,20,{"$f":"F73*mpst_nfall","v":0},"kg","Plast, PP",null,null,null,null,{"$f":"P73*EF_PP","v":0},0,null,0,null,0]
["45.68",null,"Grjótsvelgur",null,null,null,null,null,"Plast","Plast, Grjótsvelgur","Ræsi og veitur","45.68 Grjótsvelgur"]
["45.1 + 45.8",null,"Gröftur lagnaskurða og fylling í skurði",null,null,0,"m3",null,"Jarðvinna","Jarðvinna, lagnaskurðir","Ræsi og veitur","45.1 + 45.8 Gröftur lagnaskurða og fylling í skurði","Þjappað fyllingarefni",0,20,null,null,null,{"$f":"F75*(Oil_grafa+Oil_grafa+Oil_yta)","v":0},null,null,null,null,{"$f":"F75*mpV_fb/CF_þ_f*N75*EF_fl_s+F75*mpV_fb/CF_þ_f*O75*EF_fl_mi","v":0},{"$f":"S75*EF_oil","v":0},0,null,0]
[null,null,"Rafstrengir, ljósleiðari o.s.frv"]
[null,null,"Ljósleiðari",null,null,0,"m",null,"Rafstrengur","Rafstrengur","Ræsi og veitur","Rafstrengir","Ljósleiðari",2800,20,{"$f":"F77","v":0},"m","Ljósleiðari",null,null,null,null,{"$f":"P77*EF_ljosleid","v":0},{"$f":"P77*mpL_rafstr_1kv/1000*N77*EF_fl_s+P77*mpL_rafstr_1kv/1000*O77*EF_fl_i","v":0},null,{"$f":"SUM(W77:Y77)","v":0},null,0]
[null,null,"Rafstrengur, lágspenna (< 11 kV)",null,null,0,"m",null,"Rafstrengur","Rafstrengur","Ræsi og veitur","Rafstrengir","Rafstrengur, 1 kV",2800,20,{"$f":"F78","v":0},"m","Rafstrengur, 1 kV",null,null,null,null,{"$f":"P78*EF_strengur_1kv","v":0},{"$f":"P78*mpL_rafstr_1kv/1000*N78*EF_fl_s+P78*mpL_rafstr_1kv/1000*O78*EF_fl_i","v":0},null,{"$f":"SUM(W78:Y78)","v":0},null,0]
[null,null,"Rafstrengur, háspenna (≥ 11 kV)",null,null,0,"m",null,"Rafstrengur","Rafstrengur","Ræsi og veitur","Rafstrengir","Rafstrengur, 24 kV",2800,20,{"$f":"F79","v":0},"m","Rafstrengur, 24 kV",null,null,null,null,{"$f":"P79*EF_strengur_24kv","v":0},{"$f":"P79*mpL_rafstr_24kv/1000*N79*EF_fl_s+P79*mpL_rafstr_24kv/1000*O79*EF_fl_i","v":0},null,0,null,0]
[null,null,null,null,null,null,null,null,null,null,null,null,null,null,null,null,null,"Heildarolíunotkun [L]",{"$f":"SUM(S19:S79)","v":0},"Ræsi og veitur samtals",null,null,{"$f":"SUM(W19:W79)","v":0},{"$f":"SUM(X19:X79)","v":0},0,0,0,0]
["Styrktar og burðarlög"]
["52.2",null,"Styrktarlag, unnið efni"]
[null,null,"Styrktarlag undir stíga",null,null,0,"m3",null,"Jarðvinna","Jarðvinna, styrktarlag","Styrktar- og burðarlög","52.2 Styrktarlag","Þjappað styrktarlagsefni",0,20,null,null,null,{"$f":"F83*(Oil_vin+Oil_grafa+Oil_yta+Oil_valt)","v":0},null,null,null,null,{"$f":"F83*mpV_fb/CF_þ_f*N83*EF_fl_s+F83*mpV_fb/CF_þ_f*O83*EF_fl_mi","v":0},{"$f":"S83*EF_oil","v":0},{"$f":"SUM(W83:Y83)","v":0},null,{"$f":"SUM(Z83:AA83)","v":0}]
[null,null,"Styrktarlag undir vegi",null,null,0,"m3",null,"Jarðvinna","Jarðvinna, styrktarlag","Styrktar- og burðarlög","52.2 Styrktarlag","Þjappað styrktarlagsefni",0,20,null,null,null,{"$f":"F84*(Oil_vin+Oil_grafa+Oil_yta+Oil_valt)","v":0},null,null,null,null,{"$f":"F84*mpV_fb/CF_þ_f*N84*EF_fl_s+F84*mpV_fb/CF_þ_f*O84*EF_fl_mi","v":0},{"$f":"S84*EF_oil","v":0},{"$f":"SUM(W84:Y84)","v":0},null,{"$f":"SUM(Z84:AA84)","v":0}]
[null,null,"Styrktarlag undir hellur",null,null,0,"m3",null,"Jarðvinna","Jarðvinna, styrktarlag","Styrktar- og burðarlög","52.2 Styrktarlag","Þjappað styrktarlagsefni",0,20,null,null,null,{"$f":"F85*(Oil_vin+Oil_grafa+Oil_yta+Oil_valt)","v":0},null,null,null,null,{"$f":"F85*mpV_fb/CF_þ_f*N85*EF_fl_s+F85*mpV_fb/CF_þ_f*O85*EF_fl_mi","v":0},{"$f":"S85*EF_oil","v":0},{"$f":"SUM(W85:Y85)","v":0},null,0]
[null,null,"Styrktarlag undir gangstéttir",null,null,0,"m3",null,"Jarðvinna","Jarðvinna, styrktarlag","Styrktar- og burðarlög","52.2 Styrktarlag","Þjappað styrktarlagsefni",0,20,null,null,null,{"$f":"F86*(Oil_vin+Oil_grafa+Oil_yta+Oil_valt)","v":0},null,null,null,null,{"$f":"F86*mpV_fb/CF_þ_f*N86*EF_fl_s+F86*mpV_fb/CF_þ_f*O86*EF_fl_mi","v":0},{"$f":"S86*EF_oil","v":0},{"$f":"SUM(W86:Y86)","v":0},null,0]
["53.1",null,"Óbundið burðarlag",null,null,0,"m3",null,"Jarðvinna","Jarðvinna, burðarlag","Styrktar- og burðarlög","53.1 Óbundið burðarlag","Þjappað burðarlagsefni",0,20,null,null,null,{"$f":"F87*(Oil_vinm+Oil_grafa+Oil_yta+Oil_valt)","v":0},null,null,null,null,{"$f":"F87*mpV_fb/CF_þ_f*N87*EF_fl_s+F87*mpV_fb/CF_þ_f*O87*EF_fl_mi","v":0},{"$f":"S87*EF_oil","v":0},{"$f":"SUM(W87:Y87)","v":0},{"$f":"Z87*(_xlfn.CEILING.MATH(Forsíða!$D$8/ET_bur_ob)-1)","v":0},0]
[null,null,null,null,null,null,null,null,null,null,null,null,null,null,null,null,null,"Heildarolíunotkun [L]",{"$f":"SUM(S82:S87)","v":0},"Styrktar og burðarlög samtals",null,null,{"$f":"SUM(W82:W87)","v":0},{"$f":"SUM(X82:X87)","v":0},0,0,0,{"$f":"SUM(AB82:AB87)","v":0}]
["53.4",null,"Bikbundið burðarlag",null,null,"Geyma"]
["53.5",null,"Sementsbundið burðarlag",null,null,"Geyma"]
["Slitlög"]
["63.42",null,"Burðarlagsmalbik","Veldu þykkt","mm",0,"m2",null,"Malbik","Malbik, burðarlag","Slitlög","63.42 Burðarlagsmalbik","Burðarlagsmalbik",0,20,{"$f":"IFERROR(IF(F92=0,0,F92*D92/1000*mpV_malb),\"Veldu þykkt\")","v":0},"kg","Burðarlagsmalbik",{"$f":"F92*d_malb*mpV_malb*oil_malb","v":0},null,null,null,{"$f":"P92*EF_malb_bur","v":0},{"$f":"P92/1000*N92*EF_fl_s+P92/1000*O92*EF_fl_i","v":0},{"$f":"S92*EF_oil","v":0},{"$f":"SUM(W92:Y92)","v":0},{"$f":"Z92*(_xlfn.CEILING.MATH(Forsíða!$D$8/ET_malb_bur)-1)","v":0},{"$f":"SUM(Z92:AA92)","v":0}]
["63.43",null,"Slitlagsmalbik",null,null,null,null,null,null,null,null,null,null,null,null,null,null,null,null,null,null,null,null,null,null,null,null,0]
[null,null,"Slitlagsmalbik, ÁDU > 15000 ","Veldu þykkt","mm",0,"m2",null,"Malbik","Malbik, slitlag","Slitlög","63.43 Slitlagsmalbik","Slitlagsmalbik",0,20,{"$f":"IFERROR(IF(F94=0,0,F94*D94/1000*mpV_malb),\"Veldu þykkt\")","v":0},"kg","Slitlagsmalbik",{"$f":"F94*d_malb*mpV_malb*oil_malb","v":0},null,null,null,{"$f":"IFERROR(P94*EF_malb_15,\"Veldu þykkt\")","v":0},{"$f":"IFERROR(P94/1000*N94*EF_fl_s+P94/1000*O94*EF_fl_i,\"Veldu þykkt\")","v":0},{"$f":"S94*EF_oil","v":0},{"$f":"SUM(W94:Y94)","v":0},{"$f":"Z94*(_xlfn.CEILING.MATH(Forsíða!$D$8/ET_malb_15)-1)","v":0},0]
[null,null,"Slitlagsmalbik, ÁDU 3000 - 15000 ","Veldu þykkt","mm",0,"m2",null,"Malbik","Malbik, slitlag","Slitlög","63.43 Slitlagsmalbik","Slitlagsmalbik",0,20,{"$f":"IFERROR(F95*D95/1000*mpV_malb,\"Veldu þykkt\")","v":"Veldu þykkt"},"kg","Slitlagsmalbik",{"$f":"F95*d_malb*mpV_malb*oil_malb","v":0},null,null,null,{"$f":"IFERROR(P95*EF_malb_3_15,\"Veldu þykkt\")","v":"Veldu þykkt"},{"$f":"IFERROR(P95/1000*N95*EF_fl_s+P95/1000*O95*EF_fl_i, \"Veldu þykkt\")","v":"Veldu þykkt"},{"$f":"S95*EF_oil","v":0},0,{"$f":"Z95*(_xlfn.CEILING.MATH(Forsíða!$D$8/ET_malb_3_15)-1)","v":0},0]
[null,null,"Slitlagsmalbik, ÁDU < 3000 og hjóla-/göngustígar","Veldu þykkt","mm",0,"m2",null,"Malbik","Malbik, slitlag","Slitlög","63.43 Slitlagsmalbik","Slitlagsmalbik",0,20,{"$f":"IFERROR(F96*D96/1000*mpV_malb,\"Veldu þykkt\")","v":"Veldu þykkt"},"kg","Slitlagsmalbik",{"$f":"F96*d_malb*mpV_malb*oil_malb","v":0},null,null,null,{"$f":"IFERROR(P96*EF_malb_3,\"Veldu þykkt\")","v":"Veldu þykkt"},{"$f":"IFERROR(P96/1000*N96*EF_fl_s+P96/1000*O96*EF_fl_i,\"Veldu þykkt\")","v":"Veldu þykkt"},{"$f":"S96*EF_oil","v":0},0,{"$f":"Z96*(_xlfn.CEILING.MATH(Forsíða!$D$8/ET_malb_3)-1)","v":0},0]
["68.24",null,"Steypt gangstétt",null,null,0,"m2",null,"Steypa","Steypa, gangstétt","Slitlög","68.24 Steypt gangstétt","Steypt gangstétt",0,20,{"$f":"F97*d_gangs","v":0},"m3","Steypa",null,null,null,null,{"$f":"P97*EF_st_35_gang","v":0},{"$f":"P97*mpV_steypa/1000*N97*EF_fl_s+P97*mpV_steypa/1000*O97*EF_fl_i","v":0},null,0,{"$f":"Z97*(_xlfn.CEILING.MATH(Forsíða!$D$8/ET_gangst_steypa)-1)","v":0},0]
["68.25",null,"Gangstígar/eyjar/hringtorg með hellum",null,null,null,null,null,null,null,null,null,null,null,null,null,null,null,null,null,null,null,null,null,null,null,null,0]
[null,null,"Gangstígar með hellum 6 cm þykkar",60,"mm",0,"m2",null,"Steypa","Steypa, hellur","Slitlög","68.25 Gangstígar/eyjarhringtorg með hellum","Hellur",0,20,{"$f":"F99*D99/1000*mpV_hellur","v":0},"kg","hellur",null,null,null,null,{"$f":"P99*EF_hellur","v":0},{"$f":"P99/1000*N99*EF_fl_s+P99/1000*O99*EF_fl_i","v":0},null,{"$f":"SUM(W99:Y99)","v":0},{"$f":"Z99*(_xlfn.CEILING.MATH(Forsíða!$D$8/ET_gangst_hellur)-1)","v":0},0]
[null,null,"Gangstígar með hellum 8 cm þykkar",80,"mm",0,"m2",null,"Steypa","Steypa, hellur","Slitlög","68.25 Gangstígar/eyjarhringtorg með hellum","Hellur",0,20,{"$f":"F100*D100/1000*mpV_hellur","v":0},"kg","hellur",null,null,null,null,{"$f":"P100*EF_hellur","v":0},{"$f":"P100/1000*N100*EF_fl_s+P100/1000*O100*EF_fl_i","v":0},null,0,{"$f":"Z100*(_xlfn.CEILING.MATH(Forsíða!$D$8/ET_gangst_hellur)-1)","v":0},0]
[null,null,null,null,null,null,null,null,null,null,null,null,null,null,null,null,null,"Heildarolíunotkun [L]",{"$f":"SUM(S92:S100)","v":0},"Slitlög samtals",null,null,{"$f":"SUM(W92:W100)","v":0},0,0,0,0,0]
["Öryggisbúnaður og frágangur"]
["75.1",null,"Kantsteinar"]
[null,null,"Kantsteinn, hæð 20 cm",null,null,0,"m",null,"Steypa","Steypa, kantsteinn","Öryggisbúnaður og frágangur","75.1 Kantsteinar","Járnbent steypa",0,20,{"$f":"F104*Vpl_kant_st_20","v":0},"m3","steypa",null,null,null,null,{"$f":"P104*EF_st_35_kant","v":0},{"$f":"P104*mpV_steypa/1000*N104*EF_fl_s+P104*mpV_steypa/1000*O104*EF_fl_i","v":0},null,{"$f":"SUM(W104:Y104)","v":0},{"$f":"Z104*(_xlfn.CEILING.MATH(Forsíða!$D$8/ET_kantst)-1)","v":0},{"$f":"SUM(Z104:AA104)","v":0}]
[null,null,null,null,null,null,null,null,"Stál","Kambstál, kansteinn","Öryggisbúnaður og frágangur","75.1 Kantsteinar",null,2800,20,{"$f":"F104*mpl_kant_stal_20","v":0},"kg","járnalögn",null,null,null,null,{"$f":"P105*EF_kamb","v":0},{"$f":"P105/1000*N105*EF_fl_s+P105/1000*O105*EF_fl_i","v":0},null,0,{"$f":"Z105*(_xlfn.CEILING.MATH(Forsíða!$D$8/ET_kantst)-1)","v":0},0]
[null,null,"Kantsteinn, hæð 15 cm",null,null,0,"m",null,"Steypa","Steypa, kantsteinn","Öryggisbúnaður og frágangur","75.1 Kantsteinar","Járnbent steypa",0,20,{"$f":"F106*Vpl_kant_st_15","v":0},"m3","steypa",null,null,null,null,{"$f":"P106*EF_st_35_kant","v":0},{"$f":"P106*mpV_steypa/1000*N106*EF_fl_s+P106*mpV_steypa/1000*O106*EF_fl_i","v":0},null,0,{"$f":"Z106*(_xlfn.CEILING.MATH(Forsíða!$D$8/ET_kantst)-1)","v":0},0]
[null,null,null,null,null,null,null,null,"Stál","Kambstál, kansteinn","Öryggisbúnaður og frágangur","75.1 Kantsteinar",null,2800,20,{"$f":"F106*mpl_kant_stal_15","v":0},"kg","járnalögn",null,null,null,null,{"$f":"P107*EF_kamb","v":0},{"$f":"P107/1000*N107*EF_fl_s+P107/1000*O107*EF_fl_i","v":0},null,0,{"$f":"Z107*(_xlfn.CEILING.MATH(Forsíða!$D$8/ET_kantst)-1)","v":0},0]
[null,null,"Kantsteinn, hæð 10 cm",null,null,0,"m",null,"Steypa","Steypa, kantsteinn","Öryggisbúnaður og frágangur","75.1 Kantsteinar","Járnbent steypa",0,20,{"$f":"F108*Vpl_kant_st_10","v":0},"m3","steypa",null,null,null,null,{"$f":"P108*EF_st_35_kant","v":0},{"$f":"P108*mpV_steypa/1000*N108*EF_fl_s+P108*mpV_steypa/1000*O108*EF_fl_i","v":0},null,0,{"$f":"Z108*(_xlfn.CEILING.MATH(Forsíða!$D$8/ET_kantst)-1)","v":0},0]
[null,null,null,null,null,null,null,null,"Stál","Kambstál, kansteinn","Öryggisbúnaður og frágangur","75.1 Kantsteinar",null,2800,20,{"$f":"F108*mpl_kant_stal_10","v":0},"kg","járnalögn",null,null,null,null,{"$f":"P109*EF_kamb","v":0},{"$f":"P109/1000*N109*EF_fl_s+P109/1000*O109*EF_fl_i","v":0},null,0,{"$f":"Z109*(_xlfn.CEILING.MATH(Forsíða!$D$8/ET_kantst)-1)","v":0},0]
["75.2",null,"Eyjar og hringtorg, jarðvinna, 30 cm lag",null,null,0,"m2",null,"Jarðvinna","Jarðvinna, eyjar","Öryggisbúnaður og frágangur","75.2 Eyjar og hringtorg",null,0,20,{"$f":"F110*d_eyja*(mpV_fb/CF_l_f)","v":0},"kg","jarðefni",{"$f":"F110*d_eyja*Oil_veg","v":0},null,null,null,null,{"$f":"P110*N110*EF_fl_s+P110*O110*EF_fl_mi","v":0},{"$f":"S110*EF_oil","v":0},0,null,0]
["75.6",null,"Vegrið"]
[null,null,"Bitavegrið",null,null,0,"m",null,"Stál","Vegrið, galvaníserað stál","Öryggisbúnaður og frágangur","75.6 Vegrið",null,2800,20,{"$f":"F112*mpl_bvegr","v":0},"kg","galvaníserað stál",null,null,null,null,{"$f":"P112*EF_galvst_vegr","v":0},{"$f":"P112/1000*N112*EF_fl_s+P112/1000*O112*EF_fl_i","v":0},null,0,{"$f":"Z112*(_xlfn.CEILING.MATH(Forsíða!$D$8/ET_bvegr)-1)","v":0},0]
[null,null,"Röravegrið",null,null,0,"m",null,"Stál","Vegrið, galvaníserað stál","Öryggisbúnaður og frágangur","75.6 Vegrið",null,2800,20,{"$f":"F113*mpl_rvegr","v":0},"kg","galvaníserað stál",null,null,null,null,{"$f":"P113*EF_galvst_vegr","v":0},{"$f":"P113/1000*N113*EF_fl_s+P113/1000*O113*EF_fl_i","v":0},null,0,{"$f":"Z113*(_xlfn.CEILING.MATH(Forsíða!$D$8/ET_rvegr)-1)","v":0},0]
[null,null,"Víravegrið",null,null,0,"m",null,"Stál","Vegrið, stál","Öryggisbúnaður og frágangur","75.6 Vegrið",null,2800,20,{"$f":"F114*mpl_vvegr","v":0},"kg","stál",null,null,null,null,{"$f":"P114*EF_stal_vvegr","v":0},{"$f":"P114/1000*N114*EF_fl_s+P114/1000*O114*EF_fl_i","v":0},null,0,{"$f":"Z114*(_xlfn.CEILING.MATH(Forsíða!$D$8/ET_vvegr)-1)","v":0},0]
[null,null,"Steypt vegrið","Varanlegt",null,0,"m",null,"Steypa","Vegrið, steypa","Öryggisbúnaður og frágangur","75.6 Vegrið",null,0,20,{"$f":"F115*Vpl_stevegr","v":0},"m3","steypa",null,null,null,null,{"$f":"IF(D115=\"Varanlegt\",P115*EF_st_35_vegr,P115*EF_st_35_vegr/8)","v":0},{"$f":"P115*mpV_steypa/1000*N115*EF_fl_s+P115*mpV_steypa/1000*O115*EF_fl_i","v":0},null,0,null,0]
["76.45",null,"Ljósastaurar"]
[null,null,"Ljósastaur 4 m","Veldu fjölda ljóskera","ljósker á staur",0,"stk",null,"Stál","Ljósastaur, Galvaníserað stál","Öryggisbúnaður og frágangur","76.45 Ljósastuarar",null,2800,20,{"$f":"F117*mpst_ljos_4","v":0},"kg","galvaníserað stál",null,null,null,null,{"$f":"IFERROR(P117*EF_galvst_vegr,\"Veldu fjöldaljóskera\")","v":0},{"$f":"P117/1000*N117*EF_fl_s+P117/1000*O117*EF_fl_i","v":0},null,0,{"$f":"Z117*(_xlfn.CEILING.MATH(Forsíða!$D$8/ET_ljstaur)-1)","v":0},0]
[null,null,null,null,null,null,null,null,"Stál","Ljósastaur, ljósker","Öryggisbúnaður og frágangur","76.45 Ljósastuarar",null,2800,20,{"$f":"IFERROR(F117*D117,\"Ath.  innslátt\")","v":"Ath.  innslátt"},"stk","ljósker",null,null,null,null,{"$f":"IFERROR(P118*EF_ljosker,\"Ath innslátt\")","v":"Ath innslátt"},{"$f":"IFERROR(P118*mpst_ljosker/1000*N118*EF_fl_s+P118*mpst_ljosker/1000*O118*EF_fl_i,\"Ath innslátt\")","v":"Ath innslátt"},null,0,{"$f":"Z118*(_xlfn.CEILING.MATH(Forsíða!$D$8/ET_ljosker)-1)","v":0},0]
[null,null,"Ljósastaur 5 m","Veldu fjölda ljóskera","ljósker á staur",0,"stk",null,"Stál","Ljósastaur, Galvaníserað stál","Öryggisbúnaður og frágangur","76.45 Ljósastuarar",null,2800,20,{"$f":"F119*mpst_ljos_5","v":0},"kg","galvaníserað stál",null,null,null,null,{"$f":"IFERROR(P119*EF_galvst_vegr,\"Veldu fjöldaljóskera\")","v":0},{"$f":"P119/1000*N119*EF_fl_s+P119/1000*O119*EF_fl_i","v":0},null,0,{"$f":"Z119*(_xlfn.CEILING.MATH(Forsíða!$D$8/ET_ljstaur)-1)","v":0},0]
[null,null,null,null,null,null,null,null,"Stál","Ljósastaur, ljósker","Öryggisbúnaður og frágangur","76.45 Ljósastuarar",null,2800,20,{"$f":"IFERROR(F119*D119,\"Ath. innslátt\")","v":"Ath. innslátt"},"stk","ljósker",null,null,null,null,{"$f":"IFERROR(P120*EF_ljosker,\"Ath innslátt\")","v":"Ath innslátt"},{"$f":"IFERROR(P120*mpst_ljosker/1000*N120*EF_fl_s+P120*mpst_ljosker/1000*O120*EF_fl_i,\"Ath innslátt\")","v":"Ath innslátt"},null,0,{"$f":"Z120*(_xlfn.CEILING.MATH(Forsíða!$D$8/ET_ljosker)-1)","v":0},0]
[null,null,"Ljósastaur 6,3 m","Veldu fjölda ljóskera","ljósker á staur",0,"stk",null,"Stál","Ljósastaur, Galvaníserað stál","Öryggisbúnaður og frágangur","76.45 Ljósastuarar",null,2800,20,{"$f":"F121*mpst_ljos_6","v":0},"kg","galvaníserað stál",null,null,null,null,{"$f":"IFERROR(P121*EF_galvst_vegr,\"Veldu fjöldaljóskera\")","v":0},{"$f":"P121/1000*N121*EF_fl_s+P121/1000*O121*EF_fl_i","v":0},null,0,{"$f":"Z121*(_xlfn.CEILING.MATH(Forsíða!$D$8/ET_ljstaur)-1)","v":0},0]
[null,null,null,null,null,null,null,null,"Stál","Ljósastaur, ljósker","Öryggisbúnaður og frágangur","76.45 Ljósastuarar",null,2800,20,{"$f":"IFERROR(F121*D121,\"Ath. innslátt\")","v":"Ath. innslátt"},"stk","ljósker",null,null,null,null,{"$f":"IFERROR(P122*EF_ljosker,\"Ath innslátt\")","v":"Ath innslátt"},{"$f":"IFERROR(P122*mpst_ljosker/1000*N122*EF_fl_s+P122*mpst_ljosker/1000*O122*EF_fl_i,\"Ath innslátt\")","v":"Ath innslátt"},null,0,{"$f":"Z122*(_xlfn.CEILING.MATH(Forsíða!$D$8/ET_ljosker)-1)","v":0},0]
[null,null,"Ljósastaur 8 m","Veldu fjölda ljóskera","ljósker á staur",0,"stk",null,"Stál","Ljósastaur, Galvaníserað stál","Öryggisbúnaður og frágangur","76.45 Ljósastuarar",null,2800,20,{"$f":"F123*mpst_ljos_8","v":0},"kg","galvaníserað stál",null,null,null,null,{"$f":"IFERROR(P123*EF_galvst_vegr,\"Veldu fjöldaljóskera\")","v":0},{"$f":"P123/1000*N123*EF_fl_s+P123/1000*O123*EF_fl_i","v":0},null,{"$f":"SUM(W123:Y123)","v":0},{"$f":"Z123*(_xlfn.CEILING.MATH(Forsíða!$D$8/ET_ljstaur)-1)","v":0},0]
[null,null,null,null,null,null,null,null,"Stál","Ljósastaur, ljósker","Öryggisbúnaður og frágangur","76.45 Ljósastuarar",null,2800,20,{"$f":"IFERROR(F123*D123,\"Ath. innslátt\")","v":"Ath. innslátt"},"stk","ljósker",null,null,null,null,{"$f":"IFERROR(P124*EF_ljosker,\"Ath innslátt\")","v":"Ath innslátt"},{"$f":"IFERROR(P124*mpst_ljosker/1000*N124*EF_fl_s+P124*mpst_ljosker/1000*O124*EF_fl_i,\"Ath innslátt\")","v":"Ath innslátt"},null,0,{"$f":"Z124*(_xlfn.CEILING.MATH(Forsíða!$D$8/ET_ljosker)-1)","v":0},0]
[null,null,"Ljósastaur 10 m","Veldu fjölda ljóskera","ljósker á staur",0,"stk",null,"Stál","Ljósastaur, Galvaníserað stál","Öryggisbúnaður og frágangur","76.45 Ljósastuarar",null,2800,20,{"$f":"F125*mpst_ljos_10","v":0},"kg","galvaníserað stál",null,null,null,null,{"$f":"IFERROR(P125*EF_galvst_vegr,\"Veldu fjöldaljóskera\")","v":0},{"$f":"P125/1000*N125*EF_fl_s+P125/1000*O125*EF_fl_i","v":0},null,{"$f":"SUM(W125:Y125)","v":0},{"$f":"Z125*(_xlfn.CEILING.MATH(Forsíða!$D$8/ET_ljstaur)-1)","v":0},0]
[null,null,null,null,null,null,null,null,"Stál","Ljósastaur, ljósker","Öryggisbúnaður og frágangur","76.45 Ljósastuarar",null,2800,20,{"$f":"IFERROR(F125*D125,\"Ath. innslátt\")","v":"Ath. innslátt"},"stk","ljósker",null,null,null,null,{"$f":"IFERROR(P126*EF_ljosker,\"Ath innslátt\")","v":"Ath innslátt"},{"$f":"IFERROR(P126*mpst_ljosker/1000*N126*EF_fl_s+P126*mpst_ljosker/1000*O126*EF_fl_i,\"Ath innslátt\")","v":"Ath innslátt"},null,0,{"$f":"Z126*(_xlfn.CEILING.MATH(Forsíða!$D$8/ET_ljosker)-1)","v":0},0]
["75.62",null,"Vegrið á brú",null,null,0,"m",null,"Stál","Vegrið, galvaníserað stál","Öryggisbúnaður og frágangur","75.62 Vegrið á brú",null,2800,20,{"$f":"F127*mpl_rvegr_bru","v":0},"kg","galvaníserað stál",null,null,null,null,{"$f":"P127*EF_galvst_vegr","v":0},{"$f":"P127/1000*N127*EF_fl_s+P127/1000*O127*EF_fl_i","v":0},null,{"$f":"SUM(W127:Y127)","v":0},{"$f":"Z127*(_xlfn.CEILING.MATH(Forsíða!$D$8/ET_vegr_bru)-1)","v":0},0]
["75.7",null,"Handrið",null,null,0,"m",null,"Stál","Handrið, ryðfrítt stál","Öryggisbúnaður og frágangur","75.7 Handrið",null,2800,20,{"$f":"F128*mpL_handr","v":0},"kg","Ryðfrítt stál",null,null,null,null,{"$f":"P128*EF_St_bru_rf","v":0},{"$f":"P128/1000*N128*EF_fl_s+P128/1000*O128*EF_fl_i","v":0},null,0,null,0]
[null,null,null,null,null,null,null,null,null,null,null,null,null,null,null,null,null,"Heildarolíunotkun [L]",{"$f":"SUM(S103:S128)","v":0},"Öryggisbúnaður og frágangur samtals",null,null,{"$f":"SUM(W103:W128)","v":0},0,0,0,0,0]
["Brýr og steypt mannvirki"]
["83.11",null,"Bergboltar",null,null,0,"stk",null,"Stál","Kambstál, bergboltar","Brýr og steypt mannvirki","83.11 Bergboltar",null,2800,20,{"$f":"F131*mpst_bergb_bru","v":0},"kg","Bergboltar úr kambstáli",null,null,null,null,{"$f":"P131*EF_bergb","v":0},{"$f":"P131/1000*N131*EF_fl_s+P131/1000*O131*EF_fl_i","v":0},null,{"$f":"SUM(W131:Y131)","v":0},null,{"$f":"SUM(Z131:AA131)","v":0}]
[83212,null,"Steyptir staurar"]
[null,null,"Steypa",null,null,0,"m3",null,"Steypa","Steypa, steyptir staurar í brú","Brýr og steypt mannvirki","83.212 Steyptir staurar",null,0,20,{"$f":"F133","v":0},"m3","Steypa",null,null,null,null,{"$f":"P133*EF_st_35","v":0},{"$f":"P133*mpV_steypa/1000*N133*EF_fl_s+P133*mpV_steypa/1000*O133*EF_fl_i","v":0},null,0,null,{"$f":"SUM(Z133:AA133)","v":0}]
[null,null,"Járnalögn",null,null,0,"kg",null,"Stál","Kambstál, steyptir staurar í brú","Brýr og steypt mannvirki","83.212 Steyptir staurar",null,2800,20,{"$f":"F134","v":0},"kg","kambstál",null,null,null,null,{"$f":"P134*EF_kamb","v":0},{"$f":"P134/1000*N134*EF_fl_s+P134/1000*O134*EF_fl_i","v":0},null,0,null,0]
[83222,null,"Tréstaurar",null,null,0,"m3",null,"Timbur","Timbur, tréstaurar í brú","Brýr og steypt mannvirki","83.222 Tréstaurar",null,2800,20,{"$f":"F135","v":0},"m3","Timbur",null,null,null,null,{"$f":"P135*EF_timbur","v":0},{"$f":"P135*mpV_timbur/1000*N135*EF_fl_s+P135*mpV_timbur/1000*O135*EF_fl_i","v":0},null,{"$f":"SUM(W135:Y135)","v":0},null,{"$f":"SUM(Z135:AA135)","v":0}]
[83232,null,"Stálstaurar"]
[null,null,"Stálrör tómt",null,null,0,"kg",null,"Stál","Stál, stálstaurar í brú","Brýr og steypt mannvirki","83.232 Stálstaurar",null,2800,20,{"$f":"F137","v":0},"kg","Stál",null,null,null,null,{"$f":"F137*EF_St_bru","v":0},{"$f":"P137/1000*N137*EF_fl_s+P137/1000*O137*EF_fl_i","v":0},null,0,null,0]
[null,null,"Steypa",null,null,0,"m3",null,"Steypa","Steypa, stálstaurar í brú","Brýr og steypt mannvirki","83.232 Stálstaurar",null,0,20,{"$f":"F138","v":0},"m3","Steypa",null,null,null,null,{"$f":"P138*EF_st_35","v":0},{"$f":"P138*mpV_steypa/1000*N138*EF_fl_s+P138*mpV_steypa/1000*O138*EF_fl_i","v":0},null,0,null,0]
[null,null,"Járnalögn ",null,null,0,"kg",null,"Stál","Kambstál, stálstaurar í brú","Brýr og steypt mannvirki","83.232 Stálstaurar",null,2800,20,{"$f":"F139","v":0},"kg","Kambstál",null,null,null,null,{"$f":"P139*EF_kamb","v":0},{"$f":"P139/1000*N139*EF_fl_s+P139/1000*O139*EF_fl_i","v":0},null,0,null,0]
["83.6",null,"Stálþil, efni","Varanlegt",null,0,"m2",null,"Stál","Stál, stálþil","Brýr og steypt mannvirki","83.6 Stálþil",null,2800,20,{"$f":"F140*mpA_stalthil","v":0},"kg","Stálþil",null,null,null,null,{"$f":"IF(D140=\"Varanlegt\",P140*EF_stalthil,P140*EF_stalthil/3)","v":0},{"$f":"P140/1000*N140*EF_fl_s+P140/1000*O140*EF_fl_i","v":0},null,0,null,0]
["84.2",null,"Mót",null,null,0,"m2",null,"Timbur","Timbur, mót","Brýr og steypt mannvirki","84.2 Mót",null,2800,20,{"$f":"F141*d_mot","v":0},"m3","Byggingatimbur",null,null,null,null,{"$f":"P141*EF_timbur","v":0},{"$f":"P141*mpV_timbur/1000*N141*EF_fl_s+P141*mpV_timbur/1000*O141*EF_fl_i","v":0},null,{"$f":"SUM(W141:Y141)","v":0},null,{"$f":"SUM(Z141:AA141)","v":0}]
["84.31",null,"Slakbent járnalögn ",null,null,0,"kg",null,"Stál","Kambstál, járnalögn í brú","Brýr og steypt mannvirki","84.31 Slakbent járnalögn",null,2800,20,{"$f":"F142","v":0},"kg","Kambstál",null,null,null,null,{"$f":"P142*EF_kamb","v":0},{"$f":"P142/1000*N142*EF_fl_s+P142/1000*O142*EF_fl_i","v":0},null,0,null,0]
["84.36",null,"Eftirspennt járnalögn",null,null,0,"kg",null,"Stál","Kambstál, járnalögn í brú","Brýr og steypt mannvirki","84.36 Eftirspennt járnalögn",null,2800,20,{"$f":"F143","v":0},"kg","Eftirspennukaplar",null,null,null,null,{"$f":"P143*EF_eft_jarn","v":0},{"$f":"P143/1000*N143*EF_fl_s+P143/1000*O143*EF_fl_i","v":0},null,0,null,0]
["84.4",null,"Steypa"]
[null,null,"Steypa C45/C55",null,null,0,"m3",null,"Steypa","Steypa, brú","Brýr og steypt mannvirki","84.4 Steypa",null,0,20,{"$f":"F145","v":0},"m3","Steypa",null,null,null,null,{"$f":"P145*EF_st_45","v":0},{"$f":"P145*mpV_steypa/1000*N145*EF_fl_s+P145*mpV_steypa/1000*O145*EF_fl_i","v":0},null,0,null,0]
[null,null,"Steypa C35/C45",null,null,0,"m3",null,"Steypa","Steypa, brú","Brýr og steypt mannvirki","84.4 Steypa",null,0,20,{"$f":"F146","v":0},"m3","Steypa",null,null,null,null,{"$f":"P146*EF_st_35","v":0},{"$f":"P146*mpV_steypa/1000*N146*EF_fl_s+P146*mpV_steypa/1000*O146*EF_fl_i","v":0},null,0,null,0]
[null,null,"Steypa C30/C37",null,null,0,"m3",null,"Steypa","Steypa, brú","Brýr og steypt mannvirki","84.4 Steypa",null,0,20,{"$f":"F147","v":0},"m3","Steypa",null,null,null,null,{"$f":"P147*EF_st_30","v":0},{"$f":"P147*mpV_steypa/1000*N147*EF_fl_s+P147*mpV_steypa/1000*O147*EF_fl_i","v":0},null,0,null,0]
["84.57",null,"Vatnsvarnarlag undir malbik",null,null,0,"m2",null,"Annað","Vatnsvarnarlag","Brýr og steypt mannvirki","84.57 Vatnsvarnalag undir malbiki",null,2800,20,{"$f":"F148*mpA_vatnsv","v":0},"kg","Vatnsvarnarlag",null,null,null,null,{"$f":"P148*EF_vatnsv","v":0},{"$f":"P148/1000*N148*EF_fl_s+P148/1000*O148*EF_fl_i","v":0},null,0,null,0]
["85.1",null,"Stálvirki, smíði"]
[null,null,"Stálvirki, smíði, óryðfrítt",null,null,0,"tonn",null,"Stál","Stál, brú","Brýr og steypt mannvirki","85.1 Stálvirki",null,2800,20,{"$f":"F150","v":0},"tonn","Stál",null,null,null,null,{"$f":"P150*1000*EF_St_bru","v":0},{"$f":"P150*N150*EF_fl_s+P150*O150*EF_fl_i","v":0},null,0,null,0]
[null,null,"Stálvirki, smíði, ryðfrítt",null,null,0,"tonn",null,"Stál","Ryðfrítt stál, brú","Brýr og steypt mannvirki","85.1 Stálvirki",null,2800,20,{"$f":"F151","v":0},"tonn","Ryðfrítt stál",null,null,null,null,{"$f":"P151*1000*EF_St_bru_rf","v":0},{"$f":"P151*N151*EF_fl_s+P151*O151*EF_fl_i","v":0},null,0,null,0]
["86.1",null,"Legur"]
[null,null,"Lóðrétt álag <300 tonn",null,null,0,"stk",null,"Gúmmí","Gúmmí, legur","Brýr og steypt mannvirki","86.1 Legur",null,2800,20,{"$f":"F153*mpst_legur_S","v":0},"kg","Gúmmí",null,null,null,null,{"$f":"P153*EF_gummi","v":0},{"$f":"P153/1000*N153*EF_fl_s+P153/1000*O153*EF_fl_i","v":0},null,0,{"$f":"Z153*(_xlfn.CEILING.MATH(Forsíða!$D$8/ET_legur)-1)","v":0},0]
[null,null,"Lóðrétt álag >300 tonn",null,null,0,"stk",null,"Gúmmí","Gúmmí, legur","Brýr og steypt mannvirki","86.1 Legur",null,2800,20,{"$f":"F154*mpst_legur_L","v":0},"kg","Gúmmí",null,null,null,null,{"$f":"P154*EF_gummi","v":0},{"$f":"P154/1000*N154*EF_fl_s+P154/1000*O154*EF_fl_i","v":0},null,0,{"$f":"Z154*(_xlfn.CEILING.MATH(Forsíða!$D$8/ET_legur)-1)","v":0},0]
["86.4",null,"Þensluraufar",null,null,0,"m",null,"Stál","Stál, þensluraufar","Brýr og steypt mannvirki","86.4 Þensluraufar",null,2800,20,{"$f":"F155*mpL_stal_rauf","v":0},"kg","Stál",null,null,null,null,{"$f":"P155*EF_St_bru","v":0},{"$f":"P155/1000*N155*EF_fl_s+P155/1000*O155*EF_fl_i","v":0},null,{"$f":"SUM(W155:Y155)","v":0},{"$f":"Z155*(_xlfn.CEILING.MATH(Forsíða!$D$8/ET_thraufar)-1)","v":0},0]
[null,null,null,null,null,null,null,null,"Gúmmí","Gúmmí, þensluraufar","Brýr og steypt mannvirki","86.4 Þensluraufar",null,2800,20,{"$f":"F155*mpL_gummi_rauf","v":0},"kg","Gúmmí",null,null,null,null,{"$f":"P156*EF_gummi","v":0},{"$f":"P156/1000*N156*EF_fl_s+P156/1000*O156*EF_fl_i","v":0},null,{"$f":"SUM(W156:Y156)","v":0},{"$f":"Z156*(_xlfn.CEILING.MATH(Forsíða!$D$8/ET_thraufar)-1)","v":0},0]
[null,null,null,null,null,null,null,null,null,null,null,null,null,null,null,null,null,"Heildarolíunotkun [L]",{"$f":"SUM(S131:S156)","v":0},"Brýr og steypt mannvirki samtals",null,null,{"$f":"SUM(W131:W156)","v":0},{"$f":"SUM(X131:X156)","v":0},0,0,0,{"$f":"SUM(AB131:AB156)","v":0}]
["Jarðgöng"]
["22.51",null,"Gröftur í göngum ",null,null,0,"m3"]
[null,null,"Sprenging/gröftur",null,null,{"$f":"F159","v":0},"m3",null,"Jarðvinna","Jarðvinna, gangnagerð","Jarðgöng","22.51 Gröftur í göngum",null,2800,50,{"$f":"F160*mpV_spr_gong","v":0},"kg","Sprengiefni",{"$f":"F160*(Oil_gong)","v":0},{"$f":"F160*EpV_gong","v":0},"kWh","Rafmagn",{"$f":"P160*EF_spr","v":0},{"$f":"P160/1000*N160*EF_fl_s+P160/1000*O160*EF_fl_i","v":0},{"$f":"T160*EF_rafm","v":0},{"$f":"SUM(W160:Y160)","v":0},null,{"$f":"SUM(Z160:AA160)","v":0}]
[null,null,"Flutningur efnis frá vinnufleti að gangnamunna",null,null,{"$f":"F159","v":0},"m3",null,"Jarðvinna","Jarðvinna, gangnagerð","Jarðgöng","22.51 Gröftur í göngum",null,0,{"$f":"Forsíða!$D$16/4/1000","v":0},null,null,null,{"$f":"F161*(Oil_grafa)","v":0},null,null,null,null,{"$f":"F161*mpV_fb*O161*EF_fl_mi*2","v":0},{"$f":"S161*EF_oil","v":0},{"$f":"SUM(W161:Y161)","v":0},null,0]
[null,null,"Flutningur efnis frá gangnamunna",null,null,{"$f":"F160","v":0},"m3",null,"Jarðvinna","Jarðvinna, gangnagerð","Jarðgöng","22.51 Gröftur í göngum",null,0,10,null,null,null,{"$f":"F162*(Oil_grafa)","v":0},null,null,null,null,{"$f":"F162*mpV_fb*O162*EF_fl_mi*2","v":0},{"$f":"S162*EF_oil","v":0},0,null,0]
["23.2",null,"Borun könnunar og bergþéttingarhola (samtals)",null,null,0,"m",null,"Jarðvinna","Jarðvinna, gangnagerð","Jarðgöng","23.2 Borun könnunar og bergþéttingarhola",null,null,null,null,null,null,{"$f":"F163*Oil_borun","v":0},null,null,null,null,null,{"$f":"S163*EF_oil","v":0},{"$f":"SUM(W163:Y163)","v":0},null,0]
["23.6",null,"Bergþétting með sementsefju",null,null,0,"kg",null,"Steypa","Steypa, bergþétting","Jarðgöng","23.6 Bergþétting með sementsefju",null,2800,20,{"$f":"F164","v":0},"kg","Sement",null,null,null,null,{"$f":"P164*EF_cem1","v":0},{"$f":"P164/1000*N164*EF_fl_s+P164/1000*O164*EF_fl_i","v":0},null,{"$f":"SUM(W164:Y164)","v":0},null,0]
["25.2",null,"Bergboltar",null,null,0,"stk",null,"Stál","Kambstál, bergboltar","Jarðgöng","25.2 Bergboltar",null,2800,20,{"$f":"F165*(0.9*mpst_bergb_4m+0.1*mpst_bergb_6m)","v":0},"kg","Bergboltar úr kambstáli",null,null,null,null,{"$f":"P165*EF_bergb","v":0},{"$f":"P165/1000*N165*EF_fl_s+P165/1000*O165*EF_fl_i","v":0},null,{"$f":"SUM(W165:Y165)","v":0},null,0]
["25.4",null,"Sprautusteypa (styrkingar og einangrun)",null,null,0,"m3",null,"Steypa","Steypa, sprautusteypa","Jarðgöng","25.4 Sprautusteypa",null,0,20,{"$f":"F166","v":0},"m3","Sprautusteypa með stáltrefjum",null,null,null,null,{"$f":"P166*EF_spr_st","v":0},{"$f":"P166*mpV_steypa/1000*N166*EF_fl_s+P166*mpV_steypa/1000*O166*EF_fl_i","v":0},null,0,null,0]
["25.62",null,"Járnalögn (styrkingar og einangrun)",null,null,0,"kg",null,"Stál","Kambstál, járnalögn í göngum","Jarðgöng","25.62 Járnalögn",null,2000,20,{"$f":"F167","v":0},"kg","kambstál",null,null,null,null,{"$f":"P167*EF_kamb","v":0},{"$f":"P167/1000*N167*EF_fl_s+P167/1000*O167*EF_fl_i","v":0},null,0,null,0]
["26.3",null,"Dúkur undir sprautusteypu",null,null,0,"m2",null,"Plast","Jarðgangadúkur","Jarðgöng","26.3 Dúkur undir sprautusteypu",null,2800,20,{"$f":"F168*mpA_dukur","v":0},"kg","Plast, PE",null,null,null,null,{"$f":"P168*EF_dukur","v":0},{"$f":"P168/1000*N168*EF_fl_s+P168/1000*O168*EF_fl_i","v":0},{"$f":"P168*EF_dukur_a5","v":0},0,null,0]
["26.1",null,"Einangrunarklæðing undir sprautusteypu",null,null,0,"m2",null,"Plast","Einangrunarklæðning","Jarðgöng","26.1 Einangrunarklæðing undir sprautusteypu",null,2800,20,{"$f":"F169*mpA_einangr","v":0},"kg","Plast, PE",null,null,null,null,{"$f":"P169*EF_einangrun","v":0},{"$f":"P169/1000*N169*EF_fl_s+P169/1000*O169*EF_fl_i","v":0},{"$f":"P169*EF_einangrun_a5","v":0},0,null,0]
[null,null,null,null,null,null,null,null,null,null,null,null,null,null,null,null,null,"Heildarolíunotkun [L]",{"$f":"SUM(S159:S169)","v":0},"Jarðgöng samtals",null,null,{"$f":"SUM(W159:W169)","v":0},0,0,0,0,0]
[]
[null,null,null,null,null,null,null,null,null,null,null,null,null,null,null,"Heildarolíunotkun framkvæmdar",null,null,{"$f":"SUM(S170,S157,S129,S101,S88,S80,S17)","v":0},"Öll framkvæmd samtals",null,null,{"$f":"SUM(W170,W157,W129,W101,W88,W80,W17)","v":0},0,0,0,0,0]

{"sheet":"Innsláttur - Gönguleiðir","index":6,"n_rows":131,"n_cols":28,"rows_kept":131,"cut":false,"hidden":false,"merged":[[1,19,1,21],[1,22,1,27],[5,0,5,1],[5,2,5,4],[6,0,6,1],[6,2,6,4],[1,10,2,10],[1,11,2,11],[1,12,2,12],[1,15,2,15],[1,16,2,16],[1,17,2,17],[1,0,2,1],[1,2,2,4],[1,5,2,5],[1,6,2,6],[1,8,2,8],[1,9,2,9],[26,2,26,4],[27,2,27,4],[28,2,28,4],[29,2,29,4],[30,2,30,4],[31,2,31,4],[20,2,20,4],[21,2,21,4],[22,2,22,4],[23,2,23,4],[24,2,24,4],[25,2,25,4],[17,0,17,27],[4,0,4,27],[15,0,15,1],[15,2,15,4],[16,19,16,21],[18,0,18,1],[18,2,18,4],[19,2,19,4],[11,2,11,4],[12,2,12,4],[13,0,13,1],[13,2,13,4],[14,0,14,1],[14,2,14,4],[7,0,7,1],[7,2,7,4],[8,2,8,4],[9,2,9,4],[10,0,10,1],[10,2,10,4],[38,2,38,4],[39,2,39,4],[40,2,40,4],[41,2,41,4],[42,2,42,4],[43,2,43,4],[32,2,32,4],[33,2,33,4],[34,2,34,4],[35,2,35,4],[36,2,36,4],[37,2,37,4],[50,2,50,4],[51,2,51,4],[52,2,52,4],[53,2,53,4],[54,2,54,4],[55,2,55,4],[44,2,44,4],[45,2,45,4],[46,2,46,4],[47,2,47,4],[48,2,48,4],[49,2,49,4],[60,6,62,6],[60,12,62,12],[63,2,65,4],[63,5,65,5],[63,6,65,6],[63,12,65,12],[56,2,56,4],[57,2,57,4],[58,2,58,4],[59,2,59,4],[60,2,62,4],[60,5,62,5],[80,0,80,27],[72,2,72,4],[73,2,73,4],[74,2,74,4],[75,2,75,4],[79,19,79,21],[66,2,68,4],[66,5,68,5],[66,6,68,6],[66,12,68,12],[69,2,71,4],[69,5,71,5],[69,6,71,6],[69,12,71,12],[86,2,86,4],[87,2,87,4],[90,0,90,27],[87,19,87,21],[81,2,81,4],[82,2,82,4],[83,2,83,4],[84,2,84,4],[85,2,85,4],[102,0,102,1],[102,2,102,4],[103,2,104,4],[103,5,104,5],[100,19,100,21],[101,0,101,27],[91,0,91,1],[92,0,92,1],[92,2,92,4],[96,0,96,1],[96,2,96,4],[97,0,97,1],[97,2,97,4],[107,12,108,12],[109,0,109,1],[109,2,109,4],[103,6,104,6],[103,12,104,12],[105,2,106,4],[105,5,106,5],[105,6,106,6],[105,12,106,12],[110,0,110,1],[110,2,110,4],[111,0,111,1],[111,2,111,4],[112,0,112,1],[112,2,112,4],[107,2,108,4],[107,5,108,5],[107,6,108,6],[116,5,117,5],[116,6,117,6],[118,2,119,2],[118,3,119,3],[118,4,119,4],[118,5,119,5],[118,6,119,6],[113,0,113,1],[113,2,113,4],[114,0,114,1],[115,0,115,1],[115,2,115,4],[116,2,117,2],[116,3,117,3],[116,4,117,4],[126,0,126,1],[126,2,126,4],[120,2,121,2],[120,3,121,3],[120,4,121,4],[120,5,121,5],[120,6,121,6],[122,2,123,2],[122,3,123,3],[122,4,123,4],[122,5,123,5],[122,6,123,6],[130,15,130,17],[130,19,130,21],[135,18,135,21],[127,2,127,4],[128,19,128,21],[124,2,125,2],[124,3,125,3],[124,4,125,4],[124,5,125,5],[124,6,125,6]]}
[]
["Númer verkþáttar",null,"Heiti verkþáttar",null,null,"Magn","Eining",null,"Flokkur, gróft","Flokkur, ítarlegt","Yfirverkþáttur","Undirverkþáttur","Efni","Flutningsvegalengd [km]",null,"Magn","Eining","Efni","Olíunotkun [L]","Önnur efnisnotkun",null,null,"Losun (kg CO2-íg.)"]
[null,null,null,null,null,null,null,null,null,null,null,null,null,"Á sjó","Innanlands",null,null,null,"Magn","Magn","Eining","Skýring","A1-A3","A4","A5","A1-A5","B4","A1-A5 + B4"]
[]
["Skeringar og undirbygging"]
["32.1",null,"Bergskeringar í vegstæði",null,null,0,"m3 ",null,"Jarðvinna","Jarðvinna, bergskeringar","Skeringar og undirbygging","32.1 Bergskeringar í vegstæði","Fast berg",2800,20,{"$f":"F6*spr_fb","v":0},"kg","Sprengiefni",{"$f":"F6*Oil_bor","v":0},{"$f":"P6","v":0},"kg","Sprengiefni",{"$f":"P6*EF_spr","v":0},{"$f":"P6/1000*N6*EF_fl_s+P6/1000*O6*EF_fl_i","v":0},{"$f":"S6*EF_oil+T6*EF_spr","v":0},{"$f":"SUM(W6:Y6)","v":0},null,{"$f":"SUM(Z6:AA6)","v":0}]
["32.2",null,"Bergskeringar í námu",null,null,0,"m3 ",null,"Jarðvinna","Jarðvinna, bergskeringar","Skeringar og undirbygging","32.2 Bergskeringar í námu","Fast berg",2800,20,{"$f":"F7*spr_fb","v":0},"kg","Sprengiefni",{"$f":"F7*Oil_bor","v":0},{"$f":"P7","v":0},"kg","Sprengiefni",{"$f":"P7*EF_spr","v":0},{"$f":"P7/1000*N7*EF_fl_s+P7/1000*O7*EF_fl_i","v":0},{"$f":"S7*EF_oil+T7*EF_spr","v":0},{"$f":"SUM(W7:Y7)","v":0},null,{"$f":"SUM(Z7:AA7)","v":0}]
["33.1",null,"Fyllingarefni úr skeringum",null,null,null,null,null,null,null,null,null,null,null,null,null,null,null,null,null,null,null,null,null,null,null,null,0]
[null,null,"Þar af laust fyllingarefni",null,null,0,"m3 ",null,"Jarðvinna","Jarðvinna, fyllingarefni","Skeringar og undirbygging","33.1 Fyllingarefni úr skeringum","Þjappað fyllingarefni",0,20,null,null,null,{"$f":"F9*(Oil_veg+Oil_grafa+Oil_yta+Oil_valt)","v":0},null,null,null,null,{"$f":"F9*mpV_fb/CF_þ_f*N9*EF_fl_s+F9*mpV_fb/CF_þ_f*O9*EF_fl_mi","v":0},{"$f":"S9*EF_oil","v":0},0,null,0]
[null,null,"Þar af sprengt fyllingarefni",null,null,0,"m3",null,"Jarðvinna","Jarðvinna, fyllingarefni","Skeringar og undirbygging","33.1 Fyllingarefni úr skeringum","Þjappað fyllingarefni",0,20,null,null,null,{"$f":"F10*(Oil_grafa*2+Oil_yta+Oil_valt)","v":0},null,null,null,null,{"$f":"F10*mpV_fb/CF_þ_f*N10*EF_fl_s+F10*mpV_fb/CF_þ_f*O10*EF_fl_mi","v":0},{"$f":"S10*EF_oil","v":0},0,null,0]
["33.2",null,"Fyllingarefni úr námu",null,null,null,null,null,null,null,null,null,null,null,null,null,null,null,null,null,null,null,null,null,null,null,null,0]
[null,null,"Laust fyllingarefni",null,null,0,"m3",null,"Jarðvinna","Jarðvinna, fyllingarefni","Skeringar og undirbygging","33.2 Fyllingarefni úr námu","Þjappað fyllingarefni",0,20,null,null,null,{"$f":"F12*(Oil_grafa*2+Oil_yta+Oil_valt)","v":0},null,null,null,null,{"$f":"F12*mpV_fb/CF_þ_f*N12*EF_fl_s+F12*mpV_fb/CF_þ_f*O12*EF_fl_mi","v":0},{"$f":"S12*EF_oil","v":0},0,null,0]
[null,null,"Sprengt fyllingarefni",null,null,0,"m3",null,"Jarðvinna","Jarðvinna, fyllingarefni","Skeringar og undirbygging","33.2 Fyllingarefni úr námu","Þjappað fyllingarefni",0,20,null,null,null,{"$f":"F13*(Oil_grafa*2+Oil_yta+Oil_valt)","v":0},null,null,null,null,{"$f":"F13*mpV_fb/CF_þ_f*N13*EF_fl_s+F13*mpV_fb/CF_þ_f*O13*EF_fl_mi","v":0},{"$f":"S13*EF_oil","v":0},0,null,0]
["34.1",null,"Fláafleygar, efni úr skeringum",null,null,0,"m3",null,"Jarðvinna","Jarðvinna, fláafleygar","Skeringar og undirbygging","34.1 Fláafleygar, efni úr skeringum",null,0,20,null,null,null,{"$f":"F14*(Oil_veg+Oil_grafa+Oil_yta)","v":0},null,null,null,null,{"$f":"F14/1000*N14*EF_fl_s+F14/1000*O14*EF_fl_mi","v":0},{"$f":"S14*EF_oil","v":0},0,null,0]
["34.8",null,"Ónothæfu efni jafnað á losunarstað",null,null,0,"m3",null,"Jarðvinna","Jarðvinna, ónothæft efni","Skeringar og undirbygging","34.8 Ónothæfu efni jafnað á losunarstað",null,0,20,null,null,null,{"$f":"F15*(Oil_veg+Oil_yta)","v":0},null,null,null,null,{"$f":"F15/1000*N15*EF_fl_s+F15/1000*O15*EF_fl_mi","v":0},{"$f":"S15*EF_oil","v":0},0,null,0]
["36.2",null,"Grjótvörn",null,null,0,"m3",null,"Jarðvinna","Jarðvinna, grjótvörn","Skeringar og undirbygging","36.2 Grjótvörn",null,0,20,{"$f":"F16","v":0},"m3","grjót",{"$f":"F16*Oil_grjot","v":0},null,null,null,{"$f":"P16*EF_grjot","v":0},{"$f":"F16*mpV_grjot*N16*EF_fl_s+F16*mpV_grjot*O16*EF_fl_mi","v":0},{"$f":"S16*EF_oil","v":0},0,null,0]
[null,null,null,null,null,null,null,null,null,null,null,null,null,null,null,null,null,"Heildarolíunotkun [L]",{"$f":"SUM(S6:S16)","v":0},"Skeringar og undirbygging samtals",null,null,{"$f":"SUM(W6:W16)","v":0},{"$f":"SUM(X6:X16)","v":0},0,0,0,0]
["Ræsi og veitur"]
["45.71",null,"Plaströr, vatnsveita"]
[null,null,"Vatnsveiturör, D = 63 - 200 mm",null,null,0,"m",null,"Plast","Plast, Vatnsveiturör","Ræsi og veitur","45.71 Plaströr, vatnsveita","Plaströr",2800,20,{"$f":"F20*mpl_VVror_02","v":0},"kg","Plast, PE",null,null,null,null,{"$f":"P20*EF_VV_PE","v":0},{"$f":"P20/1000*N20*EF_fl_s+P20/1000*O20*EF_fl_i","v":0},null,{"$f":"SUM(W20:Y20)","v":0},null,{"$f":"SUM(Z20:AA20)","v":0}]
[null,null,"Vatnsveiturör, D = 201 - 400  mm",null,null,0,"m",null,"Plast","Plast, Vatnsveiturör","Ræsi og veitur","45.71 Plaströr, vatnsveita","Plaströr",2800,20,{"$f":"F21*mpl_VVror_04","v":0},"kg","Plast, PE",null,null,null,null,0,0,null,0,null,0]
[null,null,"Vatnsveiturör, D = 401 - 600  mm",null,null,0,"m",null,"Plast","Plast, Vatnsveiturör","Ræsi og veitur","45.71 Plaströr, vatnsveita","Plaströr",2800,20,{"$f":"F22*mpl_VVror_06","v":0},"kg","Plast, PE",null,null,null,null,0,0,null,0,null,0]
[null,null,"Vatnsveiturör, D = 601 - 800  mm",null,null,0,"m",null,"Plast","Plast, Vatnsveiturör","Ræsi og veitur","45.71 Plaströr, vatnsveita","Plaströr",2800,20,{"$f":"F23*mpl_VVror_08","v":0},"kg","Plast, PE",null,null,null,null,0,0,null,0,null,0]
[null,null,"Vatnsveiturör, D = 801 - 1000  mm",null,null,0,"m",null,"Plast","Plast, Vatnsveiturör","Ræsi og veitur","45.71 Plaströr, vatnsveita","Plaströr",2800,20,{"$f":"F24*mpl_VVror_10","v":0},"kg","Plast, PE",null,null,null,null,0,0,null,0,null,0]
[null,null,"Vatnsveiturör, D = 1001 - 1200  mm",null,null,0,"m",null,"Plast","Plast, Vatnsveiturör","Ræsi og veitur","45.71 Plaströr, vatnsveita","Plaströr",2800,20,{"$f":"F25*mpl_VVror_12","v":0},"kg","Plast, PE",null,null,null,null,0,0,null,0,null,0]
["42.3",null,"Plaströr, fráveita"]
[null,null,"Fráveiturör, D = 250 - 400 mm",null,null,0,"m",null,"Plast","Plast, fráveiturör","Ræsi og veitur","42.3 Plaströr, fráveita","Plaströr",2800,20,{"$f":"F27*mpl_FVror_04","v":0},"kg","Plast, X-Stream",null,null,null,null,{"$f":"P27*EF_FV_Xstr","v":0},{"$f":"P27/1000*N27*EF_fl_s+P27/1000*O27*EF_fl_i","v":0},null,{"$f":"SUM(W27:Y27)","v":0},null,0]
[null,null,"Fráveiturör, D = 401 - 600 mm",null,null,0,"m",null,"Plast","Plast, fráveiturör","Ræsi og veitur","42.3 Plaströr, fráveita","Plaströr",2800,20,{"$f":"F28*mpl_FVror_06","v":0},"kg","Plast, X-Stream",null,null,null,null,{"$f":"P28*EF_FV_Xstr","v":0},0,null,0,null,0]
[null,null,"Fráveiturör, D = 601 - 800 mm",null,null,0,"m",null,"Plast","Plast, fráveiturör","Ræsi og veitur","42.3 Plaströr, fráveita","Plaströr",2800,20,{"$f":"F29*mpl_FVror_08","v":0},"kg","Plast, X-Stream",null,null,null,null,{"$f":"P29*EF_FV_Xstr","v":0},0,null,0,null,0]
[null,null,"Fráveiturör, D = 801 - 1000 mm",null,null,0,"m",null,"Plast","Plast, fráveiturör","Ræsi og veitur","42.3 Plaströr, fráveita","Plaströr",2800,20,{"$f":"F30*mpl_FVror_10","v":0},"kg","Plast, Weholite",null,null,null,null,{"$f":"P30*EF_FV_Weh","v":0},0,null,0,null,0]
[null,null,"Fráveiturör, D = 1001 - 1400 mm",null,null,0,"m",null,"Plast","Plast, fráveiturör","Ræsi og veitur","42.3 Plaströr, fráveita","Plaströr",2800,20,{"$f":"F31*mpl_FVror_14","v":0},"kg","Plast, Weholite",null,null,null,null,{"$f":"P31*EF_FV_Weh","v":0},0,null,0,null,0]
[null,null,"Fráveiturör, D = 1401 - 1800 mm",null,null,0,"m",null,"Plast","Plast, fráveiturör","Ræsi og veitur","42.3 Plaströr, fráveita","Plaströr",2800,20,{"$f":"F32*mpl_FVror_18","v":0},"kg","Plast, Weholite",null,null,null,null,{"$f":"P32*EF_FV_Weh","v":0},0,null,0,null,0]
[null,null,"Fráveiturör, D = 1801 - 2200 mm",null,null,0,"m",null,"Plast","Plast, fráveiturör","Ræsi og veitur","42.3 Plaströr, fráveita","Plaströr",2800,20,{"$f":"F33*mpl_FVror_22","v":0},"kg","Plast, Weholite",null,null,null,null,{"$f":"P33*EF_FV_Weh","v":0},0,null,0,null,0]
[null,null,"Fráveiturör, D > 2200 mm",null,null,0,"m",null,"Plast","Plast, fráveiturör","Ræsi og veitur","42.3 Plaströr, fráveita","Plaströr",2800,20,{"$f":"F34*mpl_FVror_22p","v":0},"kg","Plast, Weholite",null,null,null,null,{"$f":"P34*EF_FV_Weh","v":0},0,null,0,null,0]
["45.72",null,"Hitaveiturör"]
[null,null,"Hitaveiturör, D = 250 mm",null,null,0,"m",null,"Stál","Stál, hitaveiturör","Ræsi og veitur","45.72 Hitaveiturör","PUR-einangrað stálrör",2800,20,{"$f":"F36","v":0},"m","Einangrað stálrör",null,null,null,null,{"$f":"P36*EF_Hvror_025","v":0},{"$f":"P36/1000*N36*EF_fl_s+P36/1000*O36*EF_fl_i","v":0},null,{"$f":"SUM(W36:Y36)","v":0},null,0]
[null,null,"Hitaveiturör, D = 300 mm",null,null,0,"m",null,"Stál","Stál, hitaveiturör","Ræsi og veitur","45.72 Hitaveiturör","PUR-einangrað stálrör",2800,20,0,"m","Einangrað stálrör",null,null,null,null,{"$f":"P37*EF_Hvror_03","v":0},0,null,0,null,0]
[null,null,"Hitaveiturör, D = 350 mm",null,null,0,"m",null,"Stál","Stál, hitaveiturör","Ræsi og veitur","45.72 Hitaveiturör","PUR-einangrað stálrör",2800,20,0,"m","Einangrað stálrör",null,null,null,null,{"$f":"P38*EF_Hvror_035","v":0},0,null,0,null,0]
[null,null,"Hitaveiturör, D = 400 mm",null,null,0,"m",null,"Stál","Stál, hitaveiturör","Ræsi og veitur","45.72 Hitaveiturör","PUR-einangrað stálrör",2800,20,0,"m","Einangrað stálrör",null,null,null,null,{"$f":"P39*EF_Hvror_04","v":0},0,null,0,null,0]
[null,null,"Hitaveiturör, D = 450 mm",null,null,0,"m",null,"Stál","Stál, hitaveiturör","Ræsi og veitur","45.72 Hitaveiturör","PUR-einangrað stálrör",2800,20,0,"m","Einangrað stálrör",null,null,null,null,{"$f":"P40*EF_Hvror_045","v":0},0,null,0,null,0]
[null,null,"Hitaveiturör, D = 500 mm",null,null,0,"m",null,"Stál","Stál, hitaveiturör","Ræsi og veitur","45.72 Hitaveiturör","PUR-einangrað stálrör",2800,20,0,"m","Einangrað stálrör",null,null,null,null,{"$f":"P41*EF_Hvror_05","v":0},0,null,0,null,0]
[null,null,"Hitaveiturör, D = 600 mm",null,null,0,"m",null,"Stál","Stál, hitaveiturör","Ræsi og veitur","45.72 Hitaveiturör","PUR-einangrað stálrör",2800,20,0,"m","Einangrað stálrör",null,null,null,null,{"$f":"P42*EF_Hvror_06","v":0},0,null,0,null,0]
[null,null,"Hitaveiturör, D = 700 mm",null,null,0,"m",null,"Stál","Stál, hitaveiturör","Ræsi og veitur","45.72 Hitaveiturör","PUR-einangrað stálrör",2800,20,0,"m","Einangrað stálrör",null,null,null,null,{"$f":"P43*EF_Hvror_07","v":0},0,null,0,null,0]
[null,null,"Hitaveiturör, D = 800 mm",null,null,0,"m",null,"Stál","Stál, hitaveiturör","Ræsi og veitur","45.72 Hitaveiturör","PUR-einangrað stálrör",2800,20,0,"m","Einangrað stálrör",null,null,null,null,{"$f":"P44*EF_Hvror_08","v":0},0,null,0,null,0]
["42.4",null,"Stálrör í ræsi"]
[null,42412,"Stálrör, D = 0,3 m",null,null,0,"m",null,"Stál","Stál, ræsi","Ræsi og veitur","42.4 Stálrör í ræsi","Stálrör",2800,20,{"$f":"F46*mpl_Stalror_03","v":0},"kg","Stál",null,null,null,null,{"$f":"P46*EF_Stal_ror","v":0},{"$f":"P46/1000*N46*EF_fl_s+P46/1000*O46*EF_fl_i","v":0},null,{"$f":"SUM(W46:Y46)","v":0},null,0]
[null,42415,"Stálrör, D = 0,6 m",null,null,0,"m",null,"Stál","Stál, ræsi","Ræsi og veitur","42.4 Stálrör í ræsi","Stálrör",2800,20,{"$f":"F47*mpl_Stalror_06","v":0},"kg","Stál",null,null,null,null,0,0,null,0,null,0]
[null,42417,"Stálrör, D = 0,8 m",null,null,0,"m",null,"Stál","Stál, ræsi","Ræsi og veitur","42.4 Stálrör í ræsi","Stálrör",2800,20,{"$f":"F48*mpl_Stalror_08","v":0},"kg","Stál",null,null,null,null,0,0,null,0,null,0]
[null,42422,"Stálrör, D = 1,0 m",null,null,0,"m",null,"Stál","Stál, ræsi","Ræsi og veitur","42.4 Stálrör í ræsi","Stálrör",2800,20,{"$f":"F49*mpl_Stalror_10","v":0},"kg","Stál",null,null,null,null,0,0,null,0,null,0]
[null,42424,"Stálrör, D = 1,2 m",null,null,0,"m",null,"Stál","Stál, ræsi","Ræsi og veitur","42.4 Stálrör í ræsi","Stálrör",2800,20,{"$f":"F50*mpl_Stalror_12","v":0},"kg","Stál",null,null,null,null,0,0,null,0,null,0]
[null,42428,"Stálrör, D = 1,6 m",null,null,0,"m",null,"Stál","Stál, ræsi","Ræsi og veitur","42.4 Stálrör í ræsi","Stálrör",2800,20,{"$f":"F51*mpl_Stalror_16","v":0},"kg","Stál",null,null,null,null,0,0,null,0,null,0]
[null,42432,"Stálrör, D = 2,0 m",null,null,0,"m",null,"Stál","Stál, ræsi","Ræsi og veitur","42.4 Stálrör í ræsi","Stálrör",2800,20,{"$f":"F52*mpl_Stalror_20","v":0},"kg","Stál",null,null,null,null,0,0,null,0,null,0]
[null,42442,"Stálrör, D >= 3,0 m",null,null,0,"m",null,"Stál","Stál, ræsi","Ræsi og veitur","42.4 Stálrör í ræsi","Stálrör",2800,20,{"$f":"F53*mpl_Stalror_30","v":0},"kg","Stál",null,null,null,null,0,0,null,0,null,0]
["45.4",null,"Steypt ofanvatnsræsi"]
[null,"45.41","Steypt ofanvatnsræsi, D < 120 mm",null,null,0,"m",null,"Steypa","Steypa, ofanvatnsræsi","Ræsi og veitur","45.4 Steypt ofanvatnsræsi","Steypt rör",2800,20,{"$f":"F55*mpl_Stror_120","v":0},"kg","Steypt rör",null,null,null,null,{"$f":"P55/mpV_steypa*EF_St_ror","v":0},{"$f":"P55/1000*N55*EF_fl_s+P55/1000*O55*EF_fl_i","v":0},null,{"$f":"SUM(W55:Y55)","v":0},null,0]
[null,"45.42","Steypt ofanvatnsræsi, D = 120 - 300 mm",null,null,0,"m",null,"Steypa","Steypa, ofanvatnsræsi","Ræsi og veitur","45.4 Steypt ofanvatnsræsi","Steypt rör",2800,20,{"$f":"F56*mpl_Stror_300","v":0},"kg","Steypt rör",null,null,null,null,{"$f":"P56/mpV_steypa*EF_St_ror","v":0},{"$f":"P56/1000*N56*EF_fl_s+P56/1000*O56*EF_fl_i","v":0},null,0,null,0]
[null,"45.43","Steypt ofanvatnsræsi, D = 301 - 600 mm",null,null,0,"m",null,"Steypa","Steypa, ofanvatnsræsi","Ræsi og veitur","45.4 Steypt ofanvatnsræsi","Steypt rör",2800,20,{"$f":"F57*mpl_Stror_600","v":0},"kg","Steypt rör",null,null,null,null,{"$f":"P57/mpV_steypa*EF_St_ror","v":0},{"$f":"P57/1000*N57*EF_fl_s+P57/1000*O57*EF_fl_i","v":0},null,0,null,0]
[null,"45.44","Steypt ofanvatnsræsi, D = 601 - 1000 mm",null,null,0,"m",null,"Steypa","Steypa, ofanvatnsræsi","Ræsi og veitur","45.4 Steypt ofanvatnsræsi","Steypt rör",2800,20,{"$f":"F58*mpl_Stror_1000","v":0},"kg","Steypt rör",null,null,null,null,{"$f":"P58/mpV_steypa*EF_St_ror","v":0},{"$f":"P58/1000*N58*EF_fl_s+P58/1000*O58*EF_fl_i","v":0},null,0,null,0]
[null,"45.45","Steypt ofanvatnsræsi, D > 1000 mm",null,null,0,"m",null,"Steypa","Steypa, ofanvatnsræsi","Ræsi og veitur","45.4 Steypt ofanvatnsræsi","Steypt rör",2800,20,{"$f":"F59*mpl_Stror_1000p","v":0},"kg","Steypt rör",null,null,null,null,{"$f":"P59/mpV_steypa*EF_St_ror","v":0},{"$f":"P59/1000*N59*EF_fl_s+P59/1000*O59*EF_fl_i","v":0},null,0,null,0]
["45.5",null,"Brunnar (plastbrunnar með steyptum flotkarmi og stálloki)"]
[null,null,"Brunnur, D = 600 mm, dýpt = 0-2,5 m",null,null,0,"stk",null,"Plast","Plast, brunnur","Ræsi og veitur","45.5 Brunnar","PP brunnur",2800,20,{"$f":"F61*(mpst_Br_06+mpl_BrUp_06*1)","v":0},"kg","Plast, PP",null,null,null,null,{"$f":"P61*EF_PP","v":0},{"$f":"P61/1000*N61*EF_fl_s+P61/1000*O61*EF_fl_i","v":0},null,0,null,{"$f":"SUM(Z61:AA61)","v":0}]
[null,null,null,null,null,null,null,null,"Steypa","Steypa, flotkarmur","Ræsi og veitur","45.5 Brunnar",null,2800,20,{"$f":"F61*mpst_flotk","v":0},"kg","Steyptur flotkarmur",null,null,null,null,{"$f":"P62/mpV_steypa*EF_St_ror","v":0},0,null,0,null,{"$f":"SUM(Z62:AA62)","v":0}]
[null,null,null,null,null,null,null,null,"Stál","Stál, brunnlok","Ræsi og veitur","45.5 Brunnar",null,2800,20,{"$f":"F61*mpst_br_lok","v":0},"kg","Stállok",null,null,null,null,{"$f":"P63*EF_Stal_ror","v":0},0,null,0,null,0]
[null,null,"Brunnur, D = 600 mm, dýpt > 2,5 m",null,null,0,"stk",null,"Plast","Plast, brunnur","Ræsi og veitur","45.5 Brunnar","PP brunnur",2800,20,{"$f":"F64*(mpst_Br_06+mpl_BrUp_06*3)","v":0},"kg","Plast, PP",null,null,null,null,{"$f":"P64*EF_PP","v":0},0,null,0,null,0]
[null,null,null,null,null,null,null,null,"Steypa","Steypa, flotkarmur","Ræsi og veitur","45.5 Brunnar",null,2800,20,{"$f":"F64*mpst_flotk","v":0},"kg","Steyptur flotkarmur",null,null,null,null,{"$f":"P65*EF_St_ror","v":0},0,null,0,null,0]
[null,null,null,null,null,null,null,null,"Stál","Stál, brunnlok","Ræsi og veitur","45.5 Brunnar",null,2800,20,{"$f":"F64*mpst_br_lok","v":0},"kg","Stállok",null,null,null,null,{"$f":"P66*EF_Stal_ror","v":0},0,null,0,null,0]
[null,null,"Brunnur, D = 1000 mm, dýpt = 0-2,5 m",null,null,0,"stk",null,"Plast","Plast, brunnur","Ræsi og veitur","45.5 Brunnar","PP brunnur",2800,20,{"$f":"F67*(mpst_Br_10+mpl_BrUp_10*1)","v":0},"kg","Plast, PP",null,null,null,null,{"$f":"P67*EF_PP","v":0},0,null,0,null,0]
[null,null,null,null,null,null,null,null,"Steypa","Steypa, flotkarmur","Ræsi og veitur","45.5 Brunnar",null,2800,20,{"$f":"F67*mpst_flotk","v":0},"kg","Steyptur flotkarmur",null,null,null,null,{"$f":"P68*EF_St_ror","v":0},0,null,0,null,0]
[null,null,null,null,null,null,null,null,"Stál","Stál, brunnlok","Ræsi og veitur","45.5 Brunnar",null,2800,20,{"$f":"F67*mpst_br_lok","v":0},"kg","Stállok",null,null,null,null,{"$f":"P69*EF_Stal_ror","v":0},0,null,0,null,0]
[null,null,"Brunnur, D = 1000 mm, dýpt > 2,5 m",null,null,0,"stk",null,"Plast","Plast, brunnur","Ræsi og veitur","45.5 Brunnar","PP brunnur",2800,20,{"$f":"F70*(mpst_Br_10+mpl_BrUp_10*3)","v":0},"kg","Plast, PP",null,null,null,null,{"$f":"P70*EF_PP","v":0},0,null,0,null,0]
[null,null,null,null,null,null,null,null,"Steypa","Steypa, flotkarmur","Ræsi og veitur","45.5 Brunnar",null,2800,20,{"$f":"F70*mpst_flotk","v":0},"kg","Steyptur flotkarmur",null,null,null,null,{"$f":"P71*EF_St_ror","v":0},0,null,0,null,0]
[null,null,null,null,null,null,null,null,"Stál","Stál, brunnlok","Ræsi og veitur","45.5 Brunnar",null,2800,20,{"$f":"F70*mpst_br_lok","v":0},"kg","Stállok",null,null,null,null,{"$f":"P72*EF_Stal_ror","v":0},0,null,0,null,0]
["45.6",null,"Niðurföll / sandfang",null,null,0,"stk",null,"Plast","Plast, niðurfall","Ræsi og veitur","45.6 Niðurföll / sandfang","PP niðurfall",2800,20,{"$f":"F73*mpst_nfall","v":0},"kg","Plast, PP",null,null,null,null,{"$f":"P73*EF_PP","v":0},0,null,0,null,0]
["45.68",null,"Grjótsvelgur",null,null,0,"m3",null,"Plast","Plast, Grjótsvelgur","Ræsi og veitur","45.68 Grjótsvelgur","Grjót",0,20,{"$f":"F74","v":0},"m3","grjót",{"$f":"F74*Oil_grjot","v":0},null,null,null,{"$f":"P74*EF_grjot","v":0},{"$f":"F74*mpV_grjot*N74*EF_fl_s+F74*mpV_grjot*O74*EF_fl_mi","v":0},{"$f":"S74*EF_oil","v":0},{"$f":"SUM(W74:Y74)","v":0},null,{"$f":"SUM(Z74:AA74)","v":0}]
["45.1 + 45.8",null,"Gröftur lagnaskurða og fylling í skurði",null,null,0,"m3",null,"Jarðvinna","Jarðvinna, lagnaskurðir","Ræsi og veitur","45.1 + 45.8 Gröftur lagnaskurða og fylling í skurði","Þjappað fyllingarefni",0,20,null,null,null,{"$f":"F75*(Oil_grafa+Oil_grafa+Oil_yta)","v":0},null,null,null,null,{"$f":"F75*mpV_fb/CF_þ_f*N75*EF_fl_s+F75*mpV_fb/CF_þ_f*O75*EF_fl_mi","v":0},{"$f":"S75*EF_oil","v":0},0,null,0]
[null,null,"Rafstrengir, ljósleiðari o.s.frv"]
[null,null,"Ljósleiðari",null,null,0,"m",null,"Rafstrengur","Rafstrengur","Ræsi og veitur","Rafstrengir","Ljósleiðari",2800,20,{"$f":"F77","v":0},"m","Ljósleiðari",null,null,null,null,{"$f":"P77*EF_ljosleid","v":0},{"$f":"P77*mpL_rafstr_1kv/1000*N77*EF_fl_s+P77*mpL_rafstr_1kv/1000*O77*EF_fl_i","v":0},null,{"$f":"SUM(W77:Y77)","v":0},null,0]
[null,null,"Rafstrengur, lágspenna (< 11 kV)",null,null,0,"m",null,"Rafstrengur","Rafstrengur","Ræsi og veitur","Rafstrengir","Rafstrengur, 1 kV",2800,20,{"$f":"F78","v":0},"m","Rafstrengur, 1 kV",null,null,null,null,{"$f":"P78*EF_strengur_1kv","v":0},{"$f":"P78*mpL_rafstr_1kv/1000*N78*EF_fl_s+P78*mpL_rafstr_1kv/1000*O78*EF_fl_i","v":0},null,{"$f":"SUM(W78:Y78)","v":0},null,0]
[null,null,"Rafstrengur, háspenna (≥ 11 kV)",null,null,0,"m",null,"Rafstrengur","Rafstrengur","Ræsi og veitur","Rafstrengir","Rafstrengur, 24 kV",2800,20,{"$f":"F79","v":0},"m","Rafstrengur, 24 kV",null,null,null,null,{"$f":"P79*EF_strengur_24kv","v":0},{"$f":"P79*mpL_rafstr_24kv/1000*N79*EF_fl_s+P79*mpL_rafstr_24kv/1000*O79*EF_fl_i","v":0},null,0,null,0]
[null,null,null,null,null,null,null,null,null,null,null,null,null,null,null,null,null,"Heildarolíunotkun [L]",{"$f":"SUM(S19:S79)","v":0},"Ræsi og veitur samtals",null,null,{"$f":"SUM(W19:W79)","v":0},{"$f":"SUM(X19:X79)","v":0},0,0,0,0]
["Styrktar og burðarlög"]
["52.2",null,"Styrktarlag, unnið efni"]
[null,null,"Styrktarlag undir stíga",null,null,0,"m3",null,"Jarðvinna","Jarðvinna, styrktarlag","Styrktar- og burðarlög","52.2 Styrktarlag","Þjappað styrktarlagsefni",0,20,null,null,null,{"$f":"F83*(Oil_vin+Oil_grafa+Oil_yta+Oil_valt)","v":0},null,null,null,null,{"$f":"F83*mpV_fb/CF_þ_f*N83*EF_fl_s+F83*mpV_fb/CF_þ_f*O83*EF_fl_mi","v":0},{"$f":"S83*EF_oil","v":0},{"$f":"SUM(W83:Y83)","v":0},null,{"$f":"SUM(Z83:AA83)","v":0}]
[null,null,"Styrktarlag undir vegi",null,null,0,"m3",null,"Jarðvinna","Jarðvinna, styrktarlag","Styrktar- og burðarlög","52.2 Styrktarlag","Þjappað styrktarlagsefni",0,20,null,null,null,{"$f":"F84*(Oil_vin+Oil_grafa+Oil_yta+Oil_valt)","v":0},null,null,null,null,{"$f":"F84*mpV_fb/CF_þ_f*N84*EF_fl_s+F84*mpV_fb/CF_þ_f*O84*EF_fl_mi","v":0},{"$f":"S84*EF_oil","v":0},{"$f":"SUM(W84:Y84)","v":0},null,{"$f":"SUM(Z84:AA84)","v":0}]
[null,null,"Styrktarlag undir hellur",null,null,0,"m3",null,"Jarðvinna","Jarðvinna, styrktarlag","Styrktar- og burðarlög","52.2 Styrktarlag","Þjappað styrktarlagsefni",0,20,null,null,null,{"$f":"F85*(Oil_vin+Oil_grafa+Oil_yta+Oil_valt)","v":0},null,null,null,null,{"$f":"F85*mpV_fb/CF_þ_f*N85*EF_fl_s+F85*mpV_fb/CF_þ_f*O85*EF_fl_mi","v":0},{"$f":"S85*EF_oil","v":0},{"$f":"SUM(W85:Y85)","v":0},null,0]
[null,null,"Styrktarlag undir gangstéttir",null,null,0,"m3",null,"Jarðvinna","Jarðvinna, styrktarlag","Styrktar- og burðarlög","52.2 Styrktarlag","Þjappað styrktarlagsefni",0,20,null,null,null,{"$f":"F86*(Oil_vin+Oil_grafa+Oil_yta+Oil_valt)","v":0},null,null,null,null,{"$f":"F86*mpV_fb/CF_þ_f*N86*EF_fl_s+F86*mpV_fb/CF_þ_f*O86*EF_fl_mi","v":0},{"$f":"S86*EF_oil","v":0},{"$f":"SUM(W86:Y86)","v":0},null,0]
["53.1",null,"Óbundið burðarlag",null,null,0,"m3",null,"Jarðvinna","Jarðvinna, burðarlag","Styrktar- og burðarlög","53.1 Óbundið burðarlag","Þjappað burðarlagsefni",0,20,null,null,null,{"$f":"F87*(Oil_vinm+Oil_grafa+Oil_yta+Oil_valt)","v":0},null,null,null,null,{"$f":"F87*mpV_fb/CF_þ_f*N87*EF_fl_s+F87*mpV_fb/CF_þ_f*O87*EF_fl_mi","v":0},{"$f":"S87*EF_oil","v":0},{"$f":"SUM(W87:Y87)","v":0},{"$f":"Z87*(_xlfn.CEILING.MATH(Forsíða!$D$8/ET_bur_ob)-1)","v":0},0]
[null,null,null,null,null,null,null,null,null,null,null,null,null,null,null,null,null,"Heildarolíunotkun [L]",{"$f":"SUM(S82:S87)","v":0},"Styrktar og burðarlög samtals",null,null,{"$f":"SUM(W82:W87)","v":0},{"$f":"SUM(X82:X87)","v":0},0,0,0,{"$f":"SUM(AB82:AB87)","v":0}]
["53.4",null,"Bikbundið burðarlag",null,null,"Geyma"]
["53.5",null,"Sementsbundið burðarlag",null,null,"Geyma"]
["Slitlög"]
["63.42",null,"Burðarlagsmalbik","Veldu þykkt","mm",0,"m2",null,"Malbik","Malbik, burðarlag","Slitlög","63.42 Burðarlagsmalbik","Burðarlagsmalbik",0,20,{"$f":"IFERROR(IF(F92=0,0,F92*D92/1000*mpV_malb),\"Veldu þykkt\")","v":0},"kg","Burðarlagsmalbik",{"$f":"F92*d_malb*mpV_malb*oil_malb","v":0},null,null,null,{"$f":"P92*EF_malb_bur","v":0},{"$f":"P92/1000*N92*EF_fl_s+P92/1000*O92*EF_fl_i","v":0},{"$f":"S92*EF_oil","v":0},{"$f":"SUM(W92:Y92)","v":0},{"$f":"Z92*(_xlfn.CEILING.MATH(Forsíða!$D$8/ET_malb_bur)-1)","v":0},{"$f":"SUM(Z92:AA92)","v":0}]
["63.43",null,"Slitlagsmalbik",null,null,null,null,null,null,null,null,null,null,null,null,null,null,null,null,null,null,null,null,null,null,null,null,0]
[null,null,"Slitlagsmalbik, ÁDU > 15000 ","Veldu þykkt","mm",0,"m2",null,"Malbik","Malbik, slitlag","Slitlög","63.43 Slitlagsmalbik","Slitlagsmalbik",0,20,{"$f":"IFERROR(IF(F94=0,0,F94*D94/1000*mpV_malb),\"Veldu þykkt\")","v":0},"kg","Slitlagsmalbik",{"$f":"F94*d_malb*mpV_malb*oil_malb","v":0},null,null,null,{"$f":"IFERROR(P94*EF_malb_15,\"Veldu þykkt\")","v":0},{"$f":"IFERROR(P94/1000*N94*EF_fl_s+P94/1000*O94*EF_fl_i,\"Veldu þykkt\")","v":0},{"$f":"S94*EF_oil","v":0},{"$f":"SUM(W94:Y94)","v":0},{"$f":"Z94*(_xlfn.CEILING.MATH(Forsíða!$D$8/ET_malb_15)-1)","v":0},0]
[null,null,"Slitlagsmalbik, ÁDU 3000 - 15000 ","Veldu þykkt","mm",0,"m2",null,"Malbik","Malbik, slitlag","Slitlög","63.43 Slitlagsmalbik","Slitlagsmalbik",0,20,{"$f":"IFERROR(F95*D95/1000*mpV_malb,\"Veldu þykkt\")","v":"Veldu þykkt"},"kg","Slitlagsmalbik",{"$f":"F95*d_malb*mpV_malb*oil_malb","v":0},null,null,null,{"$f":"IFERROR(P95*EF_malb_3_15,\"Veldu þykkt\")","v":"Veldu þykkt"},{"$f":"IFERROR(P95/1000*N95*EF_fl_s+P95/1000*O95*EF_fl_i, \"Veldu þykkt\")","v":"Veldu þykkt"},{"$f":"S95*EF_oil","v":0},0,{"$f":"Z95*(_xlfn.CEILING.MATH(Forsíða!$D$8/ET_malb_3_15)-1)","v":0},0]
[null,null,"Slitlagsmalbik, ÁDU < 3000 og hjóla-/göngustígar","Veldu þykkt","mm",0,"m2",null,"Malbik","Malbik, slitlag","Slitlög","63.43 Slitlagsmalbik","Slitlagsmalbik",0,20,{"$f":"IFERROR(F96*D96/1000*mpV_malb,\"Veldu þykkt\")","v":"Veldu þykkt"},"kg","Slitlagsmalbik",{"$f":"F96*d_malb*mpV_malb*oil_malb","v":0},null,null,null,{"$f":"IFERROR(P96*EF_malb_3,\"Veldu þykkt\")","v":"Veldu þykkt"},{"$f":"IFERROR(P96/1000*N96*EF_fl_s+P96/1000*O96*EF_fl_i,\"Veldu þykkt\")","v":"Veldu þykkt"},{"$f":"S96*EF_oil","v":0},0,{"$f":"Z96*(_xlfn.CEILING.MATH(Forsíða!$D$8/ET_malb_3)-1)","v":0},0]
["68.24",null,"Steypt gangstétt",null,null,0,"m2",null,"Steypa","Steypa, gangstétt","Slitlög","68.24 Steypt gangstétt","Steypt gangstétt",0,20,{"$f":"F97*d_gangs","v":0},"m3","Steypa",null,null,null,null,{"$f":"P97*EF_st_35_gang","v":0},{"$f":"P97*mpV_steypa/1000*N97*EF_fl_s+P97*mpV_steypa/1000*O97*EF_fl_i","v":0},null,0,{"$f":"Z97*(_xlfn.CEILING.MATH(Forsíða!$D$8/ET_gangst_steypa)-1)","v":0},0]
["68.25",null,"Gangstígar/eyjar/hringtorg með hellum",null,null,null,null,null,null,null,null,null,null,null,null,null,null,null,null,null,null,null,null,null,null,null,null,0]
[null,null,"Gangstígar með hellum 6 cm þykkar",60,"mm",0,"m2",null,"Steypa","Steypa, hellur","Slitlög","68.25 Gangstígar/eyjarhringtorg með hellum","Hellur",0,20,{"$f":"F99*D99/1000*mpV_hellur","v":0},"kg","hellur",null,null,null,null,{"$f":"P99*EF_hellur","v":0},{"$f":"P99/1000*N99*EF_fl_s+P99/1000*O99*EF_fl_i","v":0},null,{"$f":"SUM(W99:Y99)","v":0},{"$f":"Z99*(_xlfn.CEILING.MATH(Forsíða!$D$8/ET_gangst_hellur)-1)","v":0},0]
[null,null,"Gangstígar með hellum 8 cm þykkar",80,"mm",0,"m2",null,"Steypa","Steypa, hellur","Slitlög","68.25 Gangstígar/eyjarhringtorg með hellum","Hellur",0,20,{"$f":"F100*D100/1000*mpV_hellur","v":0},"kg","hellur",null,null,null,null,{"$f":"P100*EF_hellur","v":0},{"$f":"P100/1000*N100*EF_fl_s+P100/1000*O100*EF_fl_i","v":0},null,0,{"$f":"Z100*(_xlfn.CEILING.MATH(Forsíða!$D$8/ET_gangst_hellur)-1)","v":0},0]
[null,null,null,null,null,null,null,null,null,null,null,null,null,null,null,null,null,"Heildarolíunotkun [L]",{"$f":"SUM(S92:S100)","v":0},"Slitlög samtals",null,null,{"$f":"SUM(W92:W100)","v":0},0,0,0,0,0]
["Öryggisbúnaður og frágangur"]
["75.1",null,"Kantsteinar"]
[null,null,"Kantsteinn, hæð 20 cm",null,null,0,"m",null,"Steypa","Steypa, kantsteinn","Öryggisbúnaður og frágangur","75.1 Kantsteinar","Járnbent steypa",0,20,{"$f":"F104*Vpl_kant_st_20","v":0},"m3","steypa",null,null,null,null,{"$f":"P104*EF_st_35_kant","v":0},{"$f":"P104*mpV_steypa/1000*N104*EF_fl_s+P104*mpV_steypa/1000*O104*EF_fl_i","v":0},null,{"$f":"SUM(W104:Y104)","v":0},{"$f":"Z104*(_xlfn.CEILING.MATH(Forsíða!$D$8/ET_kantst)-1)","v":0},{"$f":"SUM(Z104:AA104)","v":0}]
[null,null,null,null,null,null,null,null,"Stál","Kambstál, kansteinn","Öryggisbúnaður og frágangur","75.1 Kantsteinar",null,2800,20,{"$f":"F104*mpl_kant_stal_20","v":0},"kg","járnalögn",null,null,null,null,{"$f":"P105*EF_kamb","v":0},{"$f":"P105/1000*N105*EF_fl_s+P105/1000*O105*EF_fl_i","v":0},null,0,{"$f":"Z105*(_xlfn.CEILING.MATH(Forsíða!$D$8/ET_kantst)-1)","v":0},0]
[null,null,"Kantsteinn, hæð 15 cm",null,null,0,"m",null,"Steypa","Steypa, kantsteinn","Öryggisbúnaður og frágangur","75.1 Kantsteinar","Járnbent steypa",0,20,{"$f":"F106*Vpl_kant_st_15","v":0},"m3","steypa",null,null,null,null,{"$f":"P106*EF_st_35_kant","v":0},{"$f":"P106*mpV_steypa/1000*N106*EF_fl_s+P106*mpV_steypa/1000*O106*EF_fl_i","v":0},null,0,{"$f":"Z106*(_xlfn.CEILING.MATH(Forsíða!$D$8/ET_kantst)-1)","v":0},0]
[null,null,null,null,null,null,null,null,"Stál","Kambstál, kansteinn","Öryggisbúnaður og frágangur","75.1 Kantsteinar",null,2800,20,{"$f":"F106*mpl_kant_stal_15","v":0},"kg","járnalögn",null,null,null,null,{"$f":"P107*EF_kamb","v":0},{"$f":"P107/1000*N107*EF_fl_s+P107/1000*O107*EF_fl_i","v":0},null,0,{"$f":"Z107*(_xlfn.CEILING.MATH(Forsíða!$D$8/ET_kantst)-1)","v":0},0]
[null,null,"Kantsteinn, hæð 10 cm",null,null,0,"m",null,"Steypa","Steypa, kantsteinn","Öryggisbúnaður og frágangur","75.1 Kantsteinar","Járnbent steypa",0,20,{"$f":"F108*Vpl_kant_st_10","v":0},"m3","steypa",null,null,null,null,{"$f":"P108*EF_st_35_kant","v":0},{"$f":"P108*mpV_steypa/1000*N108*EF_fl_s+P108*mpV_steypa/1000*O108*EF_fl_i","v":0},null,0,{"$f":"Z108*(_xlfn.CEILING.MATH(Forsíða!$D$8/ET_kantst)-1)","v":0},0]
[null,null,null,null,null,null,null,null,"Stál","Kambstál, kansteinn","Öryggisbúnaður og frágangur","75.1 Kantsteinar",null,2800,20,{"$f":"F108*mpl_kant_stal_10","v":0},"kg","járnalögn",null,null,null,null,{"$f":"P109*EF_kamb","v":0},{"$f":"P109/1000*N109*EF_fl_s+P109/1000*O109*EF_fl_i","v":0},null,0,{"$f":"Z109*(_xlfn.CEILING.MATH(Forsíða!$D$8/ET_kantst)-1)","v":0},0]
["75.2",null,"Eyjar og hringtorg, jarðvinna, 30 cm lag",null,null,0,"m2",null,"Jarðvinna","Jarðvinna, eyjar","Öryggisbúnaður og frágangur","75.2 Eyjar og hringtorg",null,0,20,{"$f":"F110*d_eyja*(mpV_fb/CF_l_f)","v":0},"kg","jarðefni",{"$f":"F110*d_eyja*Oil_veg","v":0},null,null,null,null,{"$f":"P110*N110*EF_fl_s+P110*O110*EF_fl_mi","v":0},{"$f":"S110*EF_oil","v":0},0,null,0]
["75.6",null,"Vegrið"]
[null,null,"Bitavegrið",null,null,0,"m",null,"Stál","Vegrið, galvaníserað stál","Öryggisbúnaður og frágangur","75.6 Vegrið",null,2800,20,{"$f":"F112*mpl_bvegr","v":0},"kg","galvaníserað stál",null,null,null,null,{"$f":"P112*EF_galvst_vegr","v":0},{"$f":"P112/1000*N112*EF_fl_s+P112/1000*O112*EF_fl_i","v":0},null,0,{"$f":"Z112*(_xlfn.CEILING.MATH(Forsíða!$D$8/ET_bvegr)-1)","v":0},0]
[null,null,"Röravegrið",null,null,0,"m",null,"Stál","Vegrið, galvaníserað stál","Öryggisbúnaður og frágangur","75.6 Vegrið",null,2800,20,{"$f":"F113*mpl_rvegr","v":0},"kg","galvaníserað stál",null,null,null,null,{"$f":"P113*EF_galvst_vegr","v":0},{"$f":"P113/1000*N113*EF_fl_s+P113/1000*O113*EF_fl_i","v":0},null,0,{"$f":"Z113*(_xlfn.CEILING.MATH(Forsíða!$D$8/ET_rvegr)-1)","v":0},0]
[null,null,"Víravegrið",null,null,0,"m",null,"Stál","Vegrið, stál","Öryggisbúnaður og frágangur","75.6 Vegrið",null,2800,20,{"$f":"F114*mpl_vvegr","v":0},"kg","stál",null,null,null,null,{"$f":"P114*EF_stal_vvegr","v":0},{"$f":"P114/1000*N114*EF_fl_s+P114/1000*O114*EF_fl_i","v":0},null,0,{"$f":"Z114*(_xlfn.CEILING.MATH(Forsíða!$D$8/ET_vvegr)-1)","v":0},0]
[null,null,"Steypt vegrið","Varanlegt",null,0,"m",null,"Steypa","Vegrið, steypa","Öryggisbúnaður og frágangur","75.6 Vegrið",null,0,20,{"$f":"F115*Vpl_stevegr","v":0},"m3","steypa",null,null,null,null,{"$f":"IF(D115=\"Varanlegt\",P115*EF_st_35_vegr,P115*EF_st_35_vegr/8)","v":0},{"$f":"P115*mpV_steypa/1000*N115*EF_fl_s+P115*mpV_steypa/1000*O115*EF_fl_i","v":0},null,0,null,0]
["76.45",null,"Ljósastaurar"]
[null,null,"Ljósastaur 4 m","Veldu fjölda ljóskera","ljósker á staur",0,"stk",null,"Stál","Ljósastaur, Galvaníserað stál","Öryggisbúnaður og frágangur","76.45 Ljósastuarar",null,2800,20,{"$f":"F117*mpst_ljos_4","v":0},"kg","galvaníserað stál",null,null,null,null,{"$f":"IFERROR(P117*EF_galvst_vegr,\"Veldu fjöldaljóskera\")","v":0},{"$f":"P117/1000*N117*EF_fl_s+P117/1000*O117*EF_fl_i","v":0},null,0,{"$f":"Z117*(_xlfn.CEILING.MATH(Forsíða!$D$8/ET_ljstaur)-1)","v":0},0]
[null,null,null,null,null,null,null,null,"Stál","Ljósastaur, ljósker","Öryggisbúnaður og frágangur","76.45 Ljósastuarar",null,2800,20,{"$f":"IFERROR(F117*D117,\"Ath.  innslátt\")","v":"Ath.  innslátt"},"stk","ljósker",null,null,null,null,{"$f":"IFERROR(P118*EF_ljosker,\"Ath innslátt\")","v":"Ath innslátt"},{"$f":"IFERROR(P118*mpst_ljosker/1000*N118*EF_fl_s+P118*mpst_ljosker/1000*O118*EF_fl_i,\"Ath innslátt\")","v":"Ath innslátt"},null,0,{"$f":"Z118*(_xlfn.CEILING.MATH(Forsíða!$D$8/ET_ljosker)-1)","v":0},0]
[null,null,"Ljósastaur 5 m","Veldu fjölda ljóskera","ljósker á staur",0,"stk",null,"Stál","Ljósastaur, Galvaníserað stál","Öryggisbúnaður og frágangur","76.45 Ljósastuarar",null,2800,20,{"$f":"F119*mpst_ljos_5","v":0},"kg","galvaníserað stál",null,null,null,null,{"$f":"IFERROR(P119*EF_galvst_vegr,\"Veldu fjöldaljóskera\")","v":0},{"$f":"P119/1000*N119*EF_fl_s+P119/1000*O119*EF_fl_i","v":0},null,0,{"$f":"Z119*(_xlfn.CEILING.MATH(Forsíða!$D$8/ET_ljstaur)-1)","v":0},0]
[null,null,null,null,null,null,null,null,"Stál","Ljósastaur, ljósker","Öryggisbúnaður og frágangur","76.45 Ljósastuarar",null,2800,20,{"$f":"IFERROR(F119*D119,\"Ath. innslátt\")","v":"Ath. innslátt"},"stk","ljósker",null,null,null,null,{"$f":"IFERROR(P120*EF_ljosker,\"Ath innslátt\")","v":"Ath innslátt"},{"$f":"IFERROR(P120*mpst_ljosker/1000*N120*EF_fl_s+P120*mpst_ljosker/1000*O120*EF_fl_i,\"Ath innslátt\")","v":"Ath innslátt"},null,0,{"$f":"Z120*(_xlfn.CEILING.MATH(Forsíða!$D$8/ET_ljosker)-1)","v":0},0]
[null,null,"Ljósastaur 6,3 m","Veldu fjölda ljóskera","ljósker á staur",0,"stk",null,"Stál","Ljósastaur, Galvaníserað stál","Öryggisbúnaður og frágangur","76.45 Ljósastuarar",null,2800,20,{"$f":"F121*mpst_ljos_6","v":0},"kg","galvaníserað stál",null,null,null,null,{"$f":"IFERROR(P121*EF_galvst_vegr,\"Veldu fjöldaljóskera\")","v":0},{"$f":"P121/1000*N121*EF_fl_s+P121/1000*O121*EF_fl_i","v":0},null,0,{"$f":"Z121*(_xlfn.CEILING.MATH(Forsíða!$D$8/ET_ljstaur)-1)","v":0},0]
[null,null,null,null,null,null,null,null,"Stál","Ljósastaur, ljósker","Öryggisbúnaður og frágangur","76.45 Ljósastuarar",null,2800,20,{"$f":"IFERROR(F121*D121,\"Ath. innslátt\")","v":"Ath. innslátt"},"stk","ljósker",null,null,null,null,{"$f":"IFERROR(P122*EF_ljosker,\"Ath innslátt\")","v":"Ath innslátt"},{"$f":"IFERROR(P122*mpst_ljosker/1000*N122*EF_fl_s+P122*mpst_ljosker/1000*O122*EF_fl_i,\"Ath innslátt\")","v":"Ath innslátt"},null,0,{"$f":"Z122*(_xlfn.CEILING.MATH(Forsíða!$D$8/ET_ljosker)-1)","v":0},0]
[null,null,"Ljósastaur 8 m","Veldu fjölda ljóskera","ljósker á staur",0,"stk",null,"Stál","Ljósastaur, Galvaníserað stál","Öryggisbúnaður og frágangur","76.45 Ljósastuarar",null,2800,20,{"$f":"F123*mpst_ljos_8","v":0},"kg","galvaníserað stál",null,null,null,null,{"$f":"IFERROR(P123*EF_galvst_vegr,\"Veldu fjöldaljóskera\")","v":0},{"$f":"P123/1000*N123*EF_fl_s+P123/1000*O123*EF_fl_i","v":0},null,{"$f":"SUM(W123:Y123)","v":0},{"$f":"Z123*(_xlfn.CEILING.MATH(Forsíða!$D$8/ET_ljstaur)-1)","v":0},0]
[null,null,null,null,null,null,null,null,"Stál","Ljósastaur, ljósker","Öryggisbúnaður og frágangur","76.45 Ljósastuarar",null,2800,20,{"$f":"IFERROR(F123*D123,\"Ath. innslátt\")","v":"Ath. innslátt"},"stk","ljósker",null,null,null,null,{"$f":"IFERROR(P124*EF_ljosker,\"Ath innslátt\")","v":"Ath innslátt"},{"$f":"IFERROR(P124*mpst_ljosker/1000*N124*EF_fl_s+P124*mpst_ljosker/1000*O124*EF_fl_i,\"Ath innslátt\")","v":"Ath innslátt"},null,0,{"$f":"Z124*(_xlfn.CEILING.MATH(Forsíða!$D$8/ET_ljosker)-1)","v":0},0]
[null,null,"Ljósastaur 10 m","Veldu fjölda ljóskera","ljósker á staur",0,"stk",null,"Stál","Ljósastaur, Galvaníserað stál","Öryggisbúnaður og frágangur","76.45 Ljósastuarar",null,2800,20,{"$f":"F125*mpst_ljos_10","v":0},"kg","galvaníserað stál",null,null,null,null,{"$f":"IFERROR(P125*EF_galvst_vegr,\"Veldu fjöldaljóskera\")","v":0},{"$f":"P125/1000*N125*EF_fl_s+P125/1000*O125*EF_fl_i","v":0},null,{"$f":"SUM(W125:Y125)","v":0},{"$f":"Z125*(_xlfn.CEILING.MATH(Forsíða!$D$8/ET_ljstaur)-1)","v":0},0]
[null,null,null,null,null,null,null,null,"Stál","Ljósastaur, ljósker","Öryggisbúnaður og frágangur","76.45 Ljósastuarar",null,2800,20,{"$f":"IFERROR(F125*D125,\"Ath. innslátt\")","v":"Ath. innslátt"},"stk","ljósker",null,null,null,null,{"$f":"IFERROR(P126*EF_ljosker,\"Ath innslátt\")","v":"Ath innslátt"},{"$f":"IFERROR(P126*mpst_ljosker/1000*N126*EF_fl_s+P126*mpst_ljosker/1000*O126*EF_fl_i,\"Ath innslátt\")","v":"Ath innslátt"},null,0,{"$f":"Z126*(_xlfn.CEILING.MATH(Forsíða!$D$8/ET_ljosker)-1)","v":0},0]
["75.62",null,"Vegrið á brú",null,null,0,"m",null,"Stál","Vegrið, galvaníserað stál","Öryggisbúnaður og frágangur","75.62 Vegrið á brú",null,2800,20,{"$f":"F127*mpl_rvegr_bru","v":0},"kg","galvaníserað stál",null,null,null,null,{"$f":"P127*EF_galvst_vegr","v":0},{"$f":"P127/1000*N127*EF_fl_s+P127/1000*O127*EF_fl_i","v":0},null,{"$f":"SUM(W127:Y127)","v":0},{"$f":"Z127*(_xlfn.CEILING.MATH(Forsíða!$D$8/ET_vegr_bru)-1)","v":0},0]
["75.7",null,"Handrið",null,null,0,"m",null,"Stál","Handrið, ryðfrítt stál","Öryggisbúnaður og frágangur","75.7 Handrið",null,2800,20,{"$f":"F128*mpL_handr","v":0},"kg","Ryðfrítt stál",null,null,null,null,{"$f":"P128*EF_St_bru_rf","v":0},{"$f":"P128/1000*N128*EF_fl_s+P128/1000*O128*EF_fl_i","v":0},null,0,null,0]
[null,null,null,null,null,null,null,null,null,null,null,null,null,null,null,null,null,"Heildarolíunotkun [L]",{"$f":"SUM(S103:S128)","v":0},"Öryggisbúnaður og frágangur samtals",null,null,{"$f":"SUM(W103:W128)","v":0},0,0,0,0,0]
[]
[null,null,null,null,null,null,null,null,null,null,null,null,null,null,null,"Heildarolíunotkun framkvæmdar",null,null,{"$f":"SUM(S129,S101,S88,S80,S17)","v":0},"Öll framkvæmd samtals",null,null,{"$f":"SUM(W129,W101,W88,W80,W17)","v":0},0,0,0,0,0]

{"sheet":"Niðurstöður - Vegir","index":7,"n_rows":65,"n_cols":26,"rows_kept":65,"cut":false,"hidden":false,"merged":[[13,13,13,15],[32,2,32,7],[15,1,15,7],[3,1,3,7],[5,2,5,7],[17,2,17,7],[2,21,2,23],[15,14,15,16],[16,14,16,16],[30,1,30,7],[10,11,10,16],[11,11,11,16],[3,11,3,16],[4,11,4,16],[5,11,5,16],[6,11,6,16],[7,11,7,16],[8,11,8,16],[20,11,20,15],[28,21,28,25],[15,11,15,12],[16,11,16,12]]}
[]
[null,"Niðurstöður - Vegir",null,null,null,null,null,null,null,null,"Skýrsla - Vegir"]
[null,null,null,null,null,null,null,null,null,null,null,null,null,null,null,null,null,null,null,null,null,"kg CO2-ígildi"]
[null,"Niðurstöður kolefnisútreikninga, deilt niður á yfirverkþætti og vistferilsfasa (birtar án áætlaðrar óvissu)",null,null,null,null,null,null,null,null,"Nafn verkefnis",{"$f":"IF(ISBLANK(Forsíða!D5),\"\",Forsíða!D5)","v":""},null,null,null,null,null,null,null,null,null,"Heild","Per km","per m2"]
[null,null,null,null,null,null,null,null,null,null,"Veghluti","Vegir",null,null,null,null,null,null,null,null,"A1-A3",{"$f":"L28","v":0},{"$f":"V5/($L$14/1000)","v":{"$error":"#DIV/0!"}},{"$f":"V5/$Q$14","v":{"$error":"#DIV/0!"}}]
[null,null,"kg CO2-ígildi",null,null,null,null,null,null,null,"Staðsetning",{"$f":"IF(ISBLANK(Forsíða!D6),\"\",Forsíða!D6)","v":""},null,null,null,null,null,null,null,null,"A4",{"$f":"M28","v":0},{"$f":"V6/($L$14/1000)","v":{"$error":"#DIV/0!"}},{"$f":"V6/$Q$14","v":{"$error":"#DIV/0!"}}]
[null,null,"A1-A3","A4","A5","A1-A5","B4","A1-A5 + B4",null,null,"Dagsetning greiningar",{"$f":"IF(ISBLANK(Forsíða!D7),\"\",Forsíða!D7)","v":"dd.mm.yyyy"},null,null,null,null,null,null,null,null,"A5",{"$f":"N28","v":0},{"$error":"#DIV/0!"},{"$f":"V7/$Q$14","v":{"$error":"#DIV/0!"}}]
[null,"Skeringar og undirbygging",{"$f":"SUMIF('Innsláttur - Vegir'!$K$6:$K$130,$B8,'Innsláttur - Vegir'!W$6:W$130)","v":0},{"$f":"SUMIF('Innsláttur - Vegir'!$K$6:$K$130,$B8,'Innsláttur - Vegir'!X$6:X$130)","v":0},{"$f":"SUMIF('Innsláttur - Vegir'!$K$6:$K$130,$B8,'Innsláttur - Vegir'!Y$6:Y$130)","v":0},{"$f":"SUMIF('Innsláttur - Vegir'!$K$6:$K$130,$B8,'Innsláttur - Vegir'!Z$6:Z$130)","v":0},{"$f":"SUMIF('Innsláttur - Vegir'!$K$6:$K$130,$B8,'Innsláttur - Vegir'!AA$6:AA$130)","v":0},{"$f":"G8+F8","v":0},null,null,"Greiningartími (ár)",{"$f":"IF(ISBLANK(Forsíða!D8),\"\",Forsíða!D8)","v":60},null,null,null,null,null,null,null,null,"B4",{"$f":"O28","v":0},{"$error":"#DIV/0!"},{"$f":"V8/$Q$14","v":{"$error":"#DIV/0!"}}]
[null,"Ræsi og veitur",{"$f":"SUMIF('Innsláttur - Vegir'!$K$6:$K$130,$B9,'Innsláttur - Vegir'!W$6:W$130)","v":0},{"$f":"SUMIF('Innsláttur - Vegir'!$K$6:$K$130,$B9,'Innsláttur - Vegir'!X$6:X$130)","v":0},{"$f":"SUMIF('Innsláttur - Vegir'!$K$6:$K$130,$B9,'Innsláttur - Vegir'!Y$6:Y$130)","v":0},{"$f":"SUMIF('Innsláttur - Vegir'!$K$6:$K$130,$B9,'Innsláttur - Vegir'!Z$6:Z$130)","v":0},{"$f":"SUMIF('Innsláttur - Vegir'!$K$6:$K$130,$B9,'Innsláttur - Vegir'!AA$6:AA$130)","v":0},{"$f":"G9+F9","v":0},null,null,"Unnið af",{"$f":"IF(ISBLANK(Forsíða!D9),\"\",Forsíða!D9)","v":""},null,null,null,null,null,null,null,null,"Samtals",{"$f":"SUM(V5:V8)","v":0},{"$f":"SUM(W5:W8)","v":{"$error":"#DIV/0!"}},{"$error":"#DIV/0!"}]
[null,"Styrktar- og burðarlög",{"$f":"SUMIF('Innsláttur - Vegir'!$K$6:$K$130,$B10,'Innsláttur - Vegir'!W$6:W$130)","v":0},{"$f":"SUMIF('Innsláttur - Vegir'!$K$6:$K$130,$B10,'Innsláttur - Vegir'!X$6:X$130)","v":0},{"$f":"SUMIF('Innsláttur - Vegir'!$K$6:$K$130,$B10,'Innsláttur - Vegir'!Y$6:Y$130)","v":0},{"$f":"SUMIF('Innsláttur - Vegir'!$K$6:$K$130,$B10,'Innsláttur - Vegir'!Z$6:Z$130)","v":0},{"$f":"SUMIF('Innsláttur - Vegir'!$K$6:$K$130,$B10,'Innsláttur - Vegir'!AA$6:AA$130)","v":0},{"$f":"G10+F10","v":0}]
[null,"Slitlög",{"$f":"SUMIF('Innsláttur - Vegir'!$K$6:$K$130,$B11,'Innsláttur - Vegir'!W$6:W$130)","v":0},{"$f":"SUMIF('Innsláttur - Vegir'!$K$6:$K$130,$B11,'Innsláttur - Vegir'!X$6:X$130)","v":0},{"$f":"SUMIF('Innsláttur - Vegir'!$K$6:$K$130,$B11,'Innsláttur - Vegir'!Y$6:Y$130)","v":0},{"$f":"SUMIF('Innsláttur - Vegir'!$K$6:$K$130,$B11,'Innsláttur - Vegir'!Z$6:Z$130)","v":0},{"$f":"SUMIF('Innsláttur - Vegir'!$K$6:$K$130,$B11,'Innsláttur - Vegir'!AA$6:AA$130)","v":0},0,null,null,"Árdagsumferð (ÁDU)",{"$f":"IF(ISBLANK(Forsíða!D11),\"\",Forsíða!D11)","v":""}]
[null,"Öryggisbúnaður og frágangur",{"$f":"SUMIF('Innsláttur - Vegir'!$K$6:$K$130,$B12,'Innsláttur - Vegir'!W$6:W$130)","v":0},{"$f":"SUMIF('Innsláttur - Vegir'!$K$6:$K$130,$B12,'Innsláttur - Vegir'!X$6:X$130)","v":0},{"$f":"SUMIF('Innsláttur - Vegir'!$K$6:$K$130,$B12,'Innsláttur - Vegir'!Y$6:Y$130)","v":0},{"$f":"SUMIF('Innsláttur - Vegir'!$K$6:$K$130,$B12,'Innsláttur - Vegir'!Z$6:Z$130)","v":0},{"$f":"SUMIF('Innsláttur - Vegir'!$K$6:$K$130,$B12,'Innsláttur - Vegir'!AA$6:AA$130)","v":0},0,null,null,"Framkvæmdarstig",{"$f":"IF(ISBLANK(Forsíða!D12),\"\",Forsíða!D12)","v":"Veldu framkvæmdarstig"}]
[null,"Samtals",{"$f":"SUM(C8:C12)","v":0},0,0,0,0,0]
[null,null,null,null,null,null,null,null,null,null,"Heildarlengd vegs [m]",{"$f":"Forsíða!D14","v":0},null,"Heildarflatarmál vegs [m2]",null,null,{"$f":"Forsíða!G14","v":0}]
[]
[null,"Niðurstöður kolefnisútreikninga, skipt niður á efnisflokka og vistferilsfasa",null,null,null,null,null,null,null,null,"Útreiknað heildarkolefnisspor",{"$f":"MROUND(V9/1000,10)&\" tonn CO2-ígildi\"","v":"0 tonn CO2-ígildi"},null,"Óvissubil",{"$f":"IF(L12=Sheet2!P7,\"Engin áætluð óvissa\",MROUND(V9*_xlfn.XLOOKUP(L12,Sheet2!P3:P7,Sheet2!Q3:Q7)/1000,10)&\" - \"&MROUND(V9*_xlfn.XLOOKUP(L12,Sheet2!P3:P7,Sheet2!R3:R7)/1000,10)&\" tonn CO2-ígildi\")","v":{"$error":"#N/A"}}]
[null,null,null,null,null,null,null,null,null,null,"Útreiknað kolefnisspor á m2",{"$f":"MROUND(X9,1)&\" kg CO2-ígildi/m2\"","v":{"$error":"#DIV/0!"}},null,"Óvissubil",{"$f":"IF(L12=Sheet2!P7,\"Engin áætluð óvissa\",MROUND(V9*_xlfn.XLOOKUP(L12,Sheet2!P3:P7,Sheet2!Q3:Q7)/Q14,1)&\" - \"&MROUND(V9*_xlfn.XLOOKUP(L12,Sheet2!P3:P7,Sheet2!R3:R7)/Q14,1)&\" kg CO2-ígildi/m2\")","v":{"$error":"#N/A"}}]
[null,null,"kg CO2-ígildi"]
[null,null,"A1-A3","A4","A5","A1-A5","B4","A1-A5 + B4"]
[null,"Jarðvinna",{"$f":"SUMIF('Innsláttur - Vegir'!$I$6:$I130,$B20,'Innsláttur - Vegir'!W$6:W$130)","v":0},{"$f":"SUMIF('Innsláttur - Vegir'!$I$6:$I130,$B20,'Innsláttur - Vegir'!X$6:X$130)","v":0},{"$f":"SUMIF('Innsláttur - Vegir'!$I$6:$I130,$B20,'Innsláttur - Vegir'!Y$6:Y$130)-SUMIF('Innsláttur - Vegir'!$I$6:$I130,$B20,'Innsláttur - Vegir'!S$6:S$130)*EF_oil","v":0},{"$f":"SUM(C20:E20)","v":0},{"$f":"SUMIF('Innsláttur - Vegir'!$I$6:$I130,$B20,'Innsláttur - Vegir'!AA$6:AA$130)","v":0},{"$f":"G20+F20","v":0}]
[null,"Plast",{"$f":"SUMIF('Innsláttur - Vegir'!$I$6:$I131,$B21,'Innsláttur - Vegir'!W$6:W$130)","v":0},{"$f":"SUMIF('Innsláttur - Vegir'!$I$6:$I131,$B21,'Innsláttur - Vegir'!X$6:X$130)","v":0},{"$f":"SUMIF('Innsláttur - Vegir'!$I$6:$I131,$B21,'Innsláttur - Vegir'!Y$6:Y$130)-SUMIF('Innsláttur - Vegir'!$I$6:$I131,$B21,'Innsláttur - Vegir'!S$6:S$130)*EF_oil","v":0},{"$f":"SUM(C21:E21)","v":0},{"$f":"SUMIF('Innsláttur - Vegir'!$I$6:$I131,$B21,'Innsláttur - Vegir'!AA$6:AA$130)","v":0},{"$f":"G21+F21","v":0},null,null,null,"kg CO2-ígildi"]
[null,"Stál",{"$f":"SUMIF('Innsláttur - Vegir'!$I$6:$I132,$B22,'Innsláttur - Vegir'!W$6:W$130)","v":0},{"$f":"SUMIF('Innsláttur - Vegir'!$I$6:$I132,$B22,'Innsláttur - Vegir'!X$6:X$130)","v":0},{"$f":"SUMIF('Innsláttur - Vegir'!$I$6:$I132,$B22,'Innsláttur - Vegir'!Y$6:Y$130)-SUMIF('Innsláttur - Vegir'!$I$6:$I132,$B22,'Innsláttur - Vegir'!S$6:S$130)*EF_oil","v":0},0,{"$f":"SUMIF('Innsláttur - Vegir'!$I$6:$I132,$B22,'Innsláttur - Vegir'!AA$6:AA$130)","v":0},0,null,null,null,"A1-A3","A4","A5","B4","Samtals"]
[null,"Steypa",{"$f":"SUMIF('Innsláttur - Vegir'!$I$6:$I133,$B23,'Innsláttur - Vegir'!W$6:W$130)","v":0},{"$f":"SUMIF('Innsláttur - Vegir'!$I$6:$I133,$B23,'Innsláttur - Vegir'!X$6:X$130)","v":0},{"$f":"SUMIF('Innsláttur - Vegir'!$I$6:$I133,$B23,'Innsláttur - Vegir'!Y$6:Y$130)-SUMIF('Innsláttur - Vegir'!$I$6:$I133,$B23,'Innsláttur - Vegir'!S$6:S$130)*EF_oil","v":0},0,{"$f":"SUMIF('Innsláttur - Vegir'!$I$6:$I133,$B23,'Innsláttur - Vegir'!AA$6:AA$130)","v":0},0,null,null,"Skeringar og undirbygging",{"$f":"C8","v":0},0,0,{"$f":"G8","v":0},{"$f":"SUM(L23:O23)","v":0}]
[null,"Rafstrengur",{"$f":"SUMIF('Innsláttur - Vegir'!$I$6:$I134,$B24,'Innsláttur - Vegir'!W$6:W$130)","v":0},{"$f":"SUMIF('Innsláttur - Vegir'!$I$6:$I134,$B24,'Innsláttur - Vegir'!X$6:X$130)","v":0},{"$f":"SUMIF('Innsláttur - Vegir'!$I$6:$I134,$B24,'Innsláttur - Vegir'!Y$6:Y$130)-SUMIF('Innsláttur - Vegir'!$I$6:$I134,$B24,'Innsláttur - Vegir'!S$6:S$130)*EF_oil","v":0},0,{"$f":"SUMIF('Innsláttur - Vegir'!$I$6:$I134,$B24,'Innsláttur - Vegir'!AA$6:AA$130)","v":0},0,null,null,"Ræsi og veitur",0,0,0,0,{"$f":"SUM(L24:O24)","v":0}]
[null,"Klæðing",{"$f":"SUMIF('Innsláttur - Vegir'!$I$6:$I135,$B25,'Innsláttur - Vegir'!W$6:W$130)","v":0},{"$f":"SUMIF('Innsláttur - Vegir'!$I$6:$I135,$B25,'Innsláttur - Vegir'!X$6:X$130)","v":0},{"$f":"SUMIF('Innsláttur - Vegir'!$I$6:$I135,$B25,'Innsláttur - Vegir'!Y$6:Y$130)-SUMIF('Innsláttur - Vegir'!$I$6:$I135,$B25,'Innsláttur - Vegir'!S$6:S$130)*EF_oil","v":0},0,{"$f":"SUMIF('Innsláttur - Vegir'!$I$6:$I135,$B25,'Innsláttur - Vegir'!AA$6:AA$130)","v":0},0,null,null,"Styrktar- og burðarlög",0,0,0,0,0]
[null,"Malbik",{"$f":"SUMIF('Innsláttur - Vegir'!$I$6:$I136,$B26,'Innsláttur - Vegir'!W$6:W$130)","v":0},{"$f":"SUMIF('Innsláttur - Vegir'!$I$6:$I136,$B26,'Innsláttur - Vegir'!X$6:X$130)","v":0},{"$f":"SUMIF('Innsláttur - Vegir'!$I$6:$I136,$B26,'Innsláttur - Vegir'!Y$6:Y$130)-SUMIF('Innsláttur - Vegir'!$I$6:$I136,$B26,'Innsláttur - Vegir'!S$6:S$130)*EF_oil","v":0},0,{"$f":"SUMIF('Innsláttur - Vegir'!$I$6:$I136,$B26,'Innsláttur - Vegir'!AA$6:AA$130)","v":0},0,null,null,"Slitlög",0,0,0,0,0]
[null,"Dísilolíunotkun á verkstað",{"$f":"SUMIF('Innsláttur - Vegir'!$I$6:$I141,$B27,'Innsláttur - Vegir'!W$6:W$130)","v":0},{"$f":"SUMIF('Innsláttur - Vegir'!$I$6:$I141,$B27,'Innsláttur - Vegir'!X$6:X$130)","v":0},{"$f":"'Innsláttur - Vegir'!S132*EF_oil","v":0},0,{"$f":"SUMIF('Innsláttur - Vegir'!$I$6:$I141,$B27,'Innsláttur - Vegir'!AA$6:AA$130)","v":0},0,null,null,"Öryggisbúnaður og frágangur",0,0,0,0,0]
[null,"Samtals",{"$f":"SUM(C20:C27)","v":0},0,0,0,0,0,null,null,"Samtals",{"$f":"SUM(L23:L27)","v":0},{"$f":"SUM(M23:M27)","v":0},{"$f":"SUM(N23:N27)","v":0},0,0]
[null,null,null,null,null,null,null,null,null,null,null,null,null,null,null,null,null,null,null,null,null,"kg CO2-ígildi"]
[null,null,null,null,null,null,null,null,null,null,null,null,null,null,null,null,null,null,null,null,null,"A1-A3","A4","A5","B4","Samtals"]
[null,"Niðurstöður kolefnisútreikninga, deilt niður á undirverkþætti og vistferilsfasa",null,null,null,null,null,null,null,null,null,null,null,null,null,null,null,null,null,null,"Jarðvinna",{"$f":"C20","v":0},0,0,{"$f":"G20","v":0},{"$f":"SUM(V31:Y31)","v":0}]
[null,null,null,null,null,null,null,null,null,null,null,null,null,null,null,null,null,null,null,null,"Plast",0,0,0,0,0]
[null,null,"kg CO2-ígildi",null,null,null,null,null,null,null,null,null,null,null,null,null,null,null,null,null,"Stál",0,0,0,0,0]
[null,null,"A1-A3","A4","A5","A1-A5","B4","A1-A5 + B4",null,null,null,null,null,null,null,null,null,null,null,null,"Steypa",0,0,0,0,0]
[null,"32.1 Bergskeringar í vegstæði",{"$f":"SUMIF('Innsláttur - Vegir'!$L$6:$L130,$B35,'Innsláttur - Vegir'!W$6:W$130)","v":0},{"$f":"SUMIF('Innsláttur - Vegir'!$L$6:$L130,$B35,'Innsláttur - Vegir'!X$6:X$130)","v":0},{"$f":"SUMIF('Innsláttur - Vegir'!$L$6:$L130,$B35,'Innsláttur - Vegir'!Y$6:Y$130)","v":0},{"$f":"SUMIF('Innsláttur - Vegir'!$L$6:$L130,$B35,'Innsláttur - Vegir'!Z$6:Z$130)","v":0},{"$f":"SUMIF('Innsláttur - Vegir'!$L$6:$L130,$B35,'Innsláttur - Vegir'!AA$6:AA$130)","v":0},{"$f":"SUMIF('Innsláttur - Vegir'!$L$6:$L130,$B35,'Innsláttur - Vegir'!AB$6:AB$130)","v":0},null,null,null,null,null,null,null,null,null,null,null,null,"Rafstrengur",0,0,0,0,0]
[null,"32.2 Bergskeringar í námu",{"$f":"SUMIF('Innsláttur - Vegir'!$L$6:$L131,$B36,'Innsláttur - Vegir'!W$6:W$130)","v":0},{"$f":"SUMIF('Innsláttur - Vegir'!$L$6:$L131,$B36,'Innsláttur - Vegir'!X$6:X$130)","v":0},{"$f":"SUMIF('Innsláttur - Vegir'!$L$6:$L131,$B36,'Innsláttur - Vegir'!Y$6:Y$130)","v":0},{"$f":"SUMIF('Innsláttur - Vegir'!$L$6:$L131,$B36,'Innsláttur - Vegir'!Z$6:Z$130)","v":0},{"$f":"SUMIF('Innsláttur - Vegir'!$L$6:$L131,$B36,'Innsláttur - Vegir'!AA$6:AA$130)","v":0},{"$f":"SUMIF('Innsláttur - Vegir'!$L$6:$L131,$B36,'Innsláttur - Vegir'!AB$6:AB$130)","v":0},null,null,null,null,null,null,null,null,null,null,null,null,"Klæðing",0,0,0,0,0]
[null,"33.1 Fyllingarefni úr skeringum",{"$f":"SUMIF('Innsláttur - Vegir'!$L$6:$L132,$B37,'Innsláttur - Vegir'!W$6:W$130)","v":0},{"$f":"SUMIF('Innsláttur - Vegir'!$L$6:$L132,$B37,'Innsláttur - Vegir'!X$6:X$130)","v":0},{"$f":"SUMIF('Innsláttur - Vegir'!$L$6:$L132,$B37,'Innsláttur - Vegir'!Y$6:Y$130)","v":0},{"$f":"SUMIF('Innsláttur - Vegir'!$L$6:$L132,$B37,'Innsláttur - Vegir'!Z$6:Z$130)","v":0},{"$f":"SUMIF('Innsláttur - Vegir'!$L$6:$L132,$B37,'Innsláttur - Vegir'!AA$6:AA$130)","v":0},{"$f":"SUMIF('Innsláttur - Vegir'!$L$6:$L132,$B37,'Innsláttur - Vegir'!AB$6:AB$130)","v":0},null,null,null,null,null,null,null,null,null,null,null,null,"Malbik",0,0,0,0,0]
[null,"33.2 Fyllingarefni úr námu",{"$f":"SUMIF('Innsláttur - Vegir'!$L$6:$L133,$B38,'Innsláttur - Vegir'!W$6:W$130)","v":0},{"$f":"SUMIF('Innsláttur - Vegir'!$L$6:$L133,$B38,'Innsláttur - Vegir'!X$6:X$130)","v":0},{"$f":"SUMIF('Innsláttur - Vegir'!$L$6:$L133,$B38,'Innsláttur - Vegir'!Y$6:Y$130)","v":0},{"$f":"SUMIF('Innsláttur - Vegir'!$L$6:$L133,$B38,'Innsláttur - Vegir'!Z$6:Z$130)","v":0},{"$f":"SUMIF('Innsláttur - Vegir'!$L$6:$L133,$B38,'Innsláttur - Vegir'!AA$6:AA$130)","v":0},{"$f":"SUMIF('Innsláttur - Vegir'!$L$6:$L133,$B38,'Innsláttur - Vegir'!AB$6:AB$130)","v":0},null,null,null,null,null,null,null,null,null,null,null,null,"Dísilolíunotkun á verkstað",0,0,0,0,0]
[null,"34.1 Fláafleygar, efni úr skeringum",{"$f":"SUMIF('Innsláttur - Vegir'!$L$6:$L134,$B39,'Innsláttur - Vegir'!W$6:W$130)","v":0},{"$f":"SUMIF('Innsláttur - Vegir'!$L$6:$L134,$B39,'Innsláttur - Vegir'!X$6:X$130)","v":0},{"$f":"SUMIF('Innsláttur - Vegir'!$L$6:$L134,$B39,'Innsláttur - Vegir'!Y$6:Y$130)","v":0},{"$f":"SUMIF('Innsláttur - Vegir'!$L$6:$L134,$B39,'Innsláttur - Vegir'!Z$6:Z$130)","v":0},{"$f":"SUMIF('Innsláttur - Vegir'!$L$6:$L134,$B39,'Innsláttur - Vegir'!AA$6:AA$130)","v":0},{"$f":"SUMIF('Innsláttur - Vegir'!$L$6:$L134,$B39,'Innsláttur - Vegir'!AB$6:AB$130)","v":0},null,null,null,null,null,null,null,null,null,null,null,null,"Samtals",{"$f":"SUM(V31:V38)","v":0},{"$f":"SUM(W31:W38)","v":0},{"$f":"SUM(X31:X38)","v":0},{"$f":"SUM(Y31:Y38)","v":0},{"$f":"SUM(V39:Y39)","v":0}]
[null,"34.8 Ónothæfu efni jafnað á losunarstað",{"$f":"SUMIF('Innsláttur - Vegir'!$L$6:$L135,$B40,'Innsláttur - Vegir'!W$6:W$130)","v":0},{"$f":"SUMIF('Innsláttur - Vegir'!$L$6:$L135,$B40,'Innsláttur - Vegir'!X$6:X$130)","v":0},{"$f":"SUMIF('Innsláttur - Vegir'!$L$6:$L135,$B40,'Innsláttur - Vegir'!Y$6:Y$130)","v":0},{"$f":"SUMIF('Innsláttur - Vegir'!$L$6:$L135,$B40,'Innsláttur - Vegir'!Z$6:Z$130)","v":0},{"$f":"SUMIF('Innsláttur - Vegir'!$L$6:$L135,$B40,'Innsláttur - Vegir'!AA$6:AA$130)","v":0},{"$f":"SUMIF('Innsláttur - Vegir'!$L$6:$L135,$B40,'Innsláttur - Vegir'!AB$6:AB$130)","v":0}]
[null,"36.2 Grjótvörn",{"$f":"SUMIF('Innsláttur - Vegir'!$L$6:$L136,$B41,'Innsláttur - Vegir'!W$6:W$130)","v":0},{"$f":"SUMIF('Innsláttur - Vegir'!$L$6:$L136,$B41,'Innsláttur - Vegir'!X$6:X$130)","v":0},{"$f":"SUMIF('Innsláttur - Vegir'!$L$6:$L136,$B41,'Innsláttur - Vegir'!Y$6:Y$130)","v":0},{"$f":"SUMIF('Innsláttur - Vegir'!$L$6:$L136,$B41,'Innsláttur - Vegir'!Z$6:Z$130)","v":0},{"$f":"SUMIF('Innsláttur - Vegir'!$L$6:$L136,$B41,'Innsláttur - Vegir'!AA$6:AA$130)","v":0},{"$f":"SUMIF('Innsláttur - Vegir'!$L$6:$L136,$B41,'Innsláttur - Vegir'!AB$6:AB$130)","v":0}]
[null,"45.71 Plaströr, vatnsveita",{"$f":"SUMIF('Innsláttur - Vegir'!$L$6:$L139,$B42,'Innsláttur - Vegir'!W$6:W$130)","v":0},{"$f":"SUMIF('Innsláttur - Vegir'!$L$6:$L139,$B42,'Innsláttur - Vegir'!X$6:X$130)","v":0},{"$f":"SUMIF('Innsláttur - Vegir'!$L$6:$L139,$B42,'Innsláttur - Vegir'!Y$6:Y$130)","v":0},{"$f":"SUMIF('Innsláttur - Vegir'!$L$6:$L139,$B42,'Innsláttur - Vegir'!Z$6:Z$130)","v":0},{"$f":"SUMIF('Innsláttur - Vegir'!$L$6:$L139,$B42,'Innsláttur - Vegir'!AA$6:AA$130)","v":0},{"$f":"SUMIF('Innsláttur - Vegir'!$L$6:$L139,$B42,'Innsláttur - Vegir'!AB$6:AB$130)","v":0}]
[null,"42.3 Plaströr, fráveita",{"$f":"SUMIF('Innsláttur - Vegir'!$L$6:$L140,$B43,'Innsláttur - Vegir'!W$6:W$130)","v":0},{"$f":"SUMIF('Innsláttur - Vegir'!$L$6:$L140,$B43,'Innsláttur - Vegir'!X$6:X$130)","v":0},{"$f":"SUMIF('Innsláttur - Vegir'!$L$6:$L140,$B43,'Innsláttur - Vegir'!Y$6:Y$130)","v":0},{"$f":"SUMIF('Innsláttur - Vegir'!$L$6:$L140,$B43,'Innsláttur - Vegir'!Z$6:Z$130)","v":0},{"$f":"SUMIF('Innsláttur - Vegir'!$L$6:$L140,$B43,'Innsláttur - Vegir'!AA$6:AA$130)","v":0},{"$f":"SUMIF('Innsláttur - Vegir'!$L$6:$L140,$B43,'Innsláttur - Vegir'!AB$6:AB$130)","v":0}]
[null,"45.72 Hitaveiturör",{"$f":"SUMIF('Innsláttur - Vegir'!$L$6:$L141,$B44,'Innsláttur - Vegir'!W$6:W$130)","v":0},{"$f":"SUMIF('Innsláttur - Vegir'!$L$6:$L141,$B44,'Innsláttur - Vegir'!X$6:X$130)","v":0},{"$f":"SUMIF('Innsláttur - Vegir'!$L$6:$L141,$B44,'Innsláttur - Vegir'!Y$6:Y$130)","v":0},{"$f":"SUMIF('Innsláttur - Vegir'!$L$6:$L141,$B44,'Innsláttur - Vegir'!Z$6:Z$130)","v":0},{"$f":"SUMIF('Innsláttur - Vegir'!$L$6:$L141,$B44,'Innsláttur - Vegir'!AA$6:AA$130)","v":0},{"$f":"SUMIF('Innsláttur - Vegir'!$L$6:$L141,$B44,'Innsláttur - Vegir'!AB$6:AB$130)","v":0}]
[null,"42.4 Stálrör í ræsi",{"$f":"SUMIF('Innsláttur - Vegir'!$L$6:$L142,$B45,'Innsláttur - Vegir'!W$6:W$130)","v":0},{"$f":"SUMIF('Innsláttur - Vegir'!$L$6:$L142,$B45,'Innsláttur - Vegir'!X$6:X$130)","v":0},{"$f":"SUMIF('Innsláttur - Vegir'!$L$6:$L142,$B45,'Innsláttur - Vegir'!Y$6:Y$130)","v":0},{"$f":"SUMIF('Innsláttur - Vegir'!$L$6:$L142,$B45,'Innsláttur - Vegir'!Z$6:Z$130)","v":0},{"$f":"SUMIF('Innsláttur - Vegir'!$L$6:$L142,$B45,'Innsláttur - Vegir'!AA$6:AA$130)","v":0},{"$f":"SUMIF('Innsláttur - Vegir'!$L$6:$L142,$B45,'Innsláttur - Vegir'!AB$6:AB$130)","v":0}]
[null,"45.4 Steypt ofanvatnsræsi",{"$f":"SUMIF('Innsláttur - Vegir'!$L$6:$L143,$B46,'Innsláttur - Vegir'!W$6:W$130)","v":0},{"$f":"SUMIF('Innsláttur - Vegir'!$L$6:$L143,$B46,'Innsláttur - Vegir'!X$6:X$130)","v":0},{"$f":"SUMIF('Innsláttur - Vegir'!$L$6:$L143,$B46,'Innsláttur - Vegir'!Y$6:Y$130)","v":0},{"$f":"SUMIF('Innsláttur - Vegir'!$L$6:$L143,$B46,'Innsláttur - Vegir'!Z$6:Z$130)","v":0},{"$f":"SUMIF('Innsláttur - Vegir'!$L$6:$L143,$B46,'Innsláttur - Vegir'!AA$6:AA$130)","v":0},{"$f":"SUMIF('Innsláttur - Vegir'!$L$6:$L143,$B46,'Innsláttur - Vegir'!AB$6:AB$130)","v":0}]
[null,"45.5 Brunnar",{"$f":"SUMIF('Innsláttur - Vegir'!$L$6:$L144,$B47,'Innsláttur - Vegir'!W$6:W$130)","v":0},{"$f":"SUMIF('Innsláttur - Vegir'!$L$6:$L144,$B47,'Innsláttur - Vegir'!X$6:X$130)","v":0},{"$f":"SUMIF('Innsláttur - Vegir'!$L$6:$L144,$B47,'Innsláttur - Vegir'!Y$6:Y$130)","v":0},{"$f":"SUMIF('Innsláttur - Vegir'!$L$6:$L144,$B47,'Innsláttur - Vegir'!Z$6:Z$130)","v":0},{"$f":"SUMIF('Innsláttur - Vegir'!$L$6:$L144,$B47,'Innsláttur - Vegir'!AA$6:AA$130)","v":0},{"$f":"SUMIF('Innsláttur - Vegir'!$L$6:$L144,$B47,'Innsláttur - Vegir'!AB$6:AB$130)","v":0}]
[null,"45.6 Niðurföll / sandfang",{"$f":"SUMIF('Innsláttur - Vegir'!$L$6:$L145,$B48,'Innsláttur - Vegir'!W$6:W$130)","v":0},{"$f":"SUMIF('Innsláttur - Vegir'!$L$6:$L145,$B48,'Innsláttur - Vegir'!X$6:X$130)","v":0},{"$f":"SUMIF('Innsláttur - Vegir'!$L$6:$L145,$B48,'Innsláttur - Vegir'!Y$6:Y$130)","v":0},{"$f":"SUMIF('Innsláttur - Vegir'!$L$6:$L145,$B48,'Innsláttur - Vegir'!Z$6:Z$130)","v":0},{"$f":"SUMIF('Innsláttur - Vegir'!$L$6:$L145,$B48,'Innsláttur - Vegir'!AA$6:AA$130)","v":0},{"$f":"SUMIF('Innsláttur - Vegir'!$L$6:$L145,$B48,'Innsláttur - Vegir'!AB$6:AB$130)","v":0}]
[null,"45.68 Grjótsvelgur",{"$f":"SUMIF('Innsláttur - Vegir'!$L$6:$L146,$B49,'Innsláttur - Vegir'!W$6:W$130)","v":0},{"$f":"SUMIF('Innsláttur - Vegir'!$L$6:$L146,$B49,'Innsláttur - Vegir'!X$6:X$130)","v":0},{"$f":"SUMIF('Innsláttur - Vegir'!$L$6:$L146,$B49,'Innsláttur - Vegir'!Y$6:Y$130)","v":0},{"$f":"SUMIF('Innsláttur - Vegir'!$L$6:$L146,$B49,'Innsláttur - Vegir'!Z$6:Z$130)","v":0},{"$f":"SUMIF('Innsláttur - Vegir'!$L$6:$L146,$B49,'Innsláttur - Vegir'!AA$6:AA$130)","v":0},{"$f":"SUMIF('Innsláttur - Vegir'!$L$6:$L146,$B49,'Innsláttur - Vegir'!AB$6:AB$130)","v":0}]
[null,"45.1 + 45.8 Gröftur lagnaskurða og fylling í skurði",{"$f":"SUMIF('Innsláttur - Vegir'!$L$6:$L147,$B50,'Innsláttur - Vegir'!W$6:W$130)","v":0},{"$f":"SUMIF('Innsláttur - Vegir'!$L$6:$L147,$B50,'Innsláttur - Vegir'!X$6:X$130)","v":0},{"$f":"SUMIF('Innsláttur - Vegir'!$L$6:$L147,$B50,'Innsláttur - Vegir'!Y$6:Y$130)","v":0},{"$f":"SUMIF('Innsláttur - Vegir'!$L$6:$L147,$B50,'Innsláttur - Vegir'!Z$6:Z$130)","v":0},{"$f":"SUMIF('Innsláttur - Vegir'!$L$6:$L147,$B50,'Innsláttur - Vegir'!AA$6:AA$130)","v":0},{"$f":"SUMIF('Innsláttur - Vegir'!$L$6:$L147,$B50,'Innsláttur - Vegir'!AB$6:AB$130)","v":0}]
[null,"Rafstrengir",{"$f":"SUMIF('Innsláttur - Vegir'!$L$6:$L148,$B51,'Innsláttur - Vegir'!W$6:W$130)","v":0},{"$f":"SUMIF('Innsláttur - Vegir'!$L$6:$L148,$B51,'Innsláttur - Vegir'!X$6:X$130)","v":0},{"$f":"SUMIF('Innsláttur - Vegir'!$L$6:$L148,$B51,'Innsláttur - Vegir'!Y$6:Y$130)","v":0},{"$f":"SUMIF('Innsláttur - Vegir'!$L$6:$L148,$B51,'Innsláttur - Vegir'!Z$6:Z$130)","v":0},{"$f":"SUMIF('Innsláttur - Vegir'!$L$6:$L148,$B51,'Innsláttur - Vegir'!AA$6:AA$130)","v":0},{"$f":"SUMIF('Innsláttur - Vegir'!$L$6:$L148,$B51,'Innsláttur - Vegir'!AB$6:AB$130)","v":0}]
[null,"52.2 Styrktarlag",{"$f":"SUMIF('Innsláttur - Vegir'!$L$6:$L149,$B52,'Innsláttur - Vegir'!W$6:W$130)","v":0},{"$f":"SUMIF('Innsláttur - Vegir'!$L$6:$L149,$B52,'Innsláttur - Vegir'!X$6:X$130)","v":0},{"$f":"SUMIF('Innsláttur - Vegir'!$L$6:$L149,$B52,'Innsláttur - Vegir'!Y$6:Y$130)","v":0},{"$f":"SUMIF('Innsláttur - Vegir'!$L$6:$L149,$B52,'Innsláttur - Vegir'!Z$6:Z$130)","v":0},{"$f":"SUMIF('Innsláttur - Vegir'!$L$6:$L149,$B52,'Innsláttur - Vegir'!AA$6:AA$130)","v":0},{"$f":"SUMIF('Innsláttur - Vegir'!$L$6:$L149,$B52,'Innsláttur - Vegir'!AB$6:AB$130)","v":0}]
[null,"53.1 Óbundið burðarlag",{"$f":"SUMIF('Innsláttur - Vegir'!$L$6:$L150,$B53,'Innsláttur - Vegir'!W$6:W$130)","v":0},{"$f":"SUMIF('Innsláttur - Vegir'!$L$6:$L150,$B53,'Innsláttur - Vegir'!X$6:X$130)","v":0},{"$f":"SUMIF('Innsláttur - Vegir'!$L$6:$L150,$B53,'Innsláttur - Vegir'!Y$6:Y$130)","v":0},{"$f":"SUMIF('Innsláttur - Vegir'!$L$6:$L150,$B53,'Innsláttur - Vegir'!Z$6:Z$130)","v":0},{"$f":"SUMIF('Innsláttur - Vegir'!$L$6:$L150,$B53,'Innsláttur - Vegir'!AA$6:AA$130)","v":0},{"$f":"SUMIF('Innsláttur - Vegir'!$L$6:$L150,$B53,'Innsláttur - Vegir'!AB$6:AB$130)","v":0}]
[null,"62.1 Klæðing, nýlögn",{"$f":"SUMIF('Innsláttur - Vegir'!$L$6:$L151,$B54,'Innsláttur - Vegir'!W$6:W$130)","v":0},{"$f":"SUMIF('Innsláttur - Vegir'!$L$6:$L151,$B54,'Innsláttur - Vegir'!X$6:X$130)","v":0},{"$f":"SUMIF('Innsláttur - Vegir'!$L$6:$L151,$B54,'Innsláttur - Vegir'!Y$6:Y$130)","v":0},{"$f":"SUMIF('Innsláttur - Vegir'!$L$6:$L151,$B54,'Innsláttur - Vegir'!Z$6:Z$130)","v":0},{"$f":"SUMIF('Innsláttur - Vegir'!$L$6:$L151,$B54,'Innsláttur - Vegir'!AA$6:AA$130)","v":0},{"$f":"SUMIF('Innsláttur - Vegir'!$L$6:$L151,$B54,'Innsláttur - Vegir'!AB$6:AB$130)","v":0}]
[null,"63.42 Burðarlagsmalbik",{"$f":"SUMIF('Innsláttur - Vegir'!$L$6:$L152,$B55,'Innsláttur - Vegir'!W$6:W$130)","v":0},{"$f":"SUMIF('Innsláttur - Vegir'!$L$6:$L152,$B55,'Innsláttur - Vegir'!X$6:X$130)","v":0},{"$f":"SUMIF('Innsláttur - Vegir'!$L$6:$L152,$B55,'Innsláttur - Vegir'!Y$6:Y$130)","v":0},{"$f":"SUMIF('Innsláttur - Vegir'!$L$6:$L152,$B55,'Innsláttur - Vegir'!Z$6:Z$130)","v":0},{"$f":"SUMIF('Innsláttur - Vegir'!$L$6:$L152,$B55,'Innsláttur - Vegir'!AA$6:AA$130)","v":0},{"$f":"SUMIF('Innsláttur - Vegir'!$L$6:$L152,$B55,'Innsláttur - Vegir'!AB$6:AB$130)","v":0}]
[null,"63.43 Slitlagsmalbik",{"$f":"SUMIF('Innsláttur - Vegir'!$L$6:$L153,$B56,'Innsláttur - Vegir'!W$6:W$130)","v":0},{"$f":"SUMIF('Innsláttur - Vegir'!$L$6:$L153,$B56,'Innsláttur - Vegir'!X$6:X$130)","v":0},{"$f":"SUMIF('Innsláttur - Vegir'!$L$6:$L153,$B56,'Innsláttur - Vegir'!Y$6:Y$130)","v":0},{"$f":"SUMIF('Innsláttur - Vegir'!$L$6:$L153,$B56,'Innsláttur - Vegir'!Z$6:Z$130)","v":0},{"$f":"SUMIF('Innsláttur - Vegir'!$L$6:$L153,$B56,'Innsláttur - Vegir'!AA$6:AA$130)","v":0},{"$f":"SUMIF('Innsláttur - Vegir'!$L$6:$L153,$B56,'Innsláttur - Vegir'!AB$6:AB$130)","v":0}]
[null,"68.24 Steypt gangstétt",{"$f":"SUMIF('Innsláttur - Vegir'!$L$6:$L154,$B57,'Innsláttur - Vegir'!W$6:W$130)","v":0},{"$f":"SUMIF('Innsláttur - Vegir'!$L$6:$L154,$B57,'Innsláttur - Vegir'!X$6:X$130)","v":0},{"$f":"SUMIF('Innsláttur - Vegir'!$L$6:$L154,$B57,'Innsláttur - Vegir'!Y$6:Y$130)","v":0},{"$f":"SUMIF('Innsláttur - Vegir'!$L$6:$L154,$B57,'Innsláttur - Vegir'!Z$6:Z$130)","v":0},{"$f":"SUMIF('Innsláttur - Vegir'!$L$6:$L154,$B57,'Innsláttur - Vegir'!AA$6:AA$130)","v":0},{"$f":"SUMIF('Innsláttur - Vegir'!$L$6:$L154,$B57,'Innsláttur - Vegir'!AB$6:AB$130)","v":0}]
[null,"68.25 Gangstígar/eyjarhringtorg með hellum",{"$f":"SUMIF('Innsláttur - Vegir'!$L$6:$L155,$B58,'Innsláttur - Vegir'!W$6:W$130)","v":0},{"$f":"SUMIF('Innsláttur - Vegir'!$L$6:$L155,$B58,'Innsláttur - Vegir'!X$6:X$130)","v":0},{"$f":"SUMIF('Innsláttur - Vegir'!$L$6:$L155,$B58,'Innsláttur - Vegir'!Y$6:Y$130)","v":0},{"$f":"SUMIF('Innsláttur - Vegir'!$L$6:$L155,$B58,'Innsláttur - Vegir'!Z$6:Z$130)","v":0},{"$f":"SUMIF('Innsláttur - Vegir'!$L$6:$L155,$B58,'Innsláttur - Vegir'!AA$6:AA$130)","v":0},{"$f":"SUMIF('Innsláttur - Vegir'!$L$6:$L155,$B58,'Innsláttur - Vegir'!AB$6:AB$130)","v":0}]
[null,"75.1 Kantsteinar",{"$f":"SUMIF('Innsláttur - Vegir'!$L$6:$L156,$B59,'Innsláttur - Vegir'!W$6:W$130)","v":0},{"$f":"SUMIF('Innsláttur - Vegir'!$L$6:$L156,$B59,'Innsláttur - Vegir'!X$6:X$130)","v":0},{"$f":"SUMIF('Innsláttur - Vegir'!$L$6:$L156,$B59,'Innsláttur - Vegir'!Y$6:Y$130)","v":0},{"$f":"SUMIF('Innsláttur - Vegir'!$L$6:$L156,$B59,'Innsláttur - Vegir'!Z$6:Z$130)","v":0},{"$f":"SUMIF('Innsláttur - Vegir'!$L$6:$L156,$B59,'Innsláttur - Vegir'!AA$6:AA$130)","v":0},{"$f":"SUMIF('Innsláttur - Vegir'!$L$6:$L156,$B59,'Innsláttur - Vegir'!AB$6:AB$130)","v":0}]
[null,"75.2 Eyjar og hringtorg",{"$f":"SUMIF('Innsláttur - Vegir'!$L$6:$L157,$B60,'Innsláttur - Vegir'!W$6:W$130)","v":0},{"$f":"SUMIF('Innsláttur - Vegir'!$L$6:$L157,$B60,'Innsláttur - Vegir'!X$6:X$130)","v":0},{"$f":"SUMIF('Innsláttur - Vegir'!$L$6:$L157,$B60,'Innsláttur - Vegir'!Y$6:Y$130)","v":0},{"$f":"SUMIF('Innsláttur - Vegir'!$L$6:$L157,$B60,'Innsláttur - Vegir'!Z$6:Z$130)","v":0},{"$f":"SUMIF('Innsláttur - Vegir'!$L$6:$L157,$B60,'Innsláttur - Vegir'!AA$6:AA$130)","v":0},{"$f":"SUMIF('Innsláttur - Vegir'!$L$6:$L157,$B60,'Innsláttur - Vegir'!AB$6:AB$130)","v":0}]
[null,"75.6 Vegrið",{"$f":"SUMIF('Innsláttur - Vegir'!$L$6:$L158,$B61,'Innsláttur - Vegir'!W$6:W$130)","v":0},{"$f":"SUMIF('Innsláttur - Vegir'!$L$6:$L158,$B61,'Innsláttur - Vegir'!X$6:X$130)","v":0},{"$f":"SUMIF('Innsláttur - Vegir'!$L$6:$L158,$B61,'Innsláttur - Vegir'!Y$6:Y$130)","v":0},{"$f":"SUMIF('Innsláttur - Vegir'!$L$6:$L158,$B61,'Innsláttur - Vegir'!Z$6:Z$130)","v":0},{"$f":"SUMIF('Innsláttur - Vegir'!$L$6:$L158,$B61,'Innsláttur - Vegir'!AA$6:AA$130)","v":0},{"$f":"SUMIF('Innsláttur - Vegir'!$L$6:$L158,$B61,'Innsláttur - Vegir'!AB$6:AB$130)","v":0}]
[null,"76.45 Ljósastuarar",{"$f":"SUMIF('Innsláttur - Vegir'!$L$6:$L159,$B62,'Innsláttur - Vegir'!W$6:W$130)","v":0},{"$f":"SUMIF('Innsláttur - Vegir'!$L$6:$L159,$B62,'Innsláttur - Vegir'!X$6:X$130)","v":0},{"$f":"SUMIF('Innsláttur - Vegir'!$L$6:$L159,$B62,'Innsláttur - Vegir'!Y$6:Y$130)","v":0},{"$f":"SUMIF('Innsláttur - Vegir'!$L$6:$L159,$B62,'Innsláttur - Vegir'!Z$6:Z$130)","v":0},{"$f":"SUMIF('Innsláttur - Vegir'!$L$6:$L159,$B62,'Innsláttur - Vegir'!AA$6:AA$130)","v":0},{"$f":"SUMIF('Innsláttur - Vegir'!$L$6:$L159,$B62,'Innsláttur - Vegir'!AB$6:AB$130)","v":0}]
[null,"75.62 Vegrið á brú",{"$f":"SUMIF('Innsláttur - Vegir'!$L$6:$L160,$B63,'Innsláttur - Vegir'!W$6:W$130)","v":0},{"$f":"SUMIF('Innsláttur - Vegir'!$L$6:$L160,$B63,'Innsláttur - Vegir'!X$6:X$130)","v":0},{"$f":"SUMIF('Innsláttur - Vegir'!$L$6:$L160,$B63,'Innsláttur - Vegir'!Y$6:Y$130)","v":0},{"$f":"SUMIF('Innsláttur - Vegir'!$L$6:$L160,$B63,'Innsláttur - Vegir'!Z$6:Z$130)","v":0},{"$f":"SUMIF('Innsláttur - Vegir'!$L$6:$L160,$B63,'Innsláttur - Vegir'!AA$6:AA$130)","v":0},{"$f":"SUMIF('Innsláttur - Vegir'!$L$6:$L160,$B63,'Innsláttur - Vegir'!AB$6:AB$130)","v":0}]
[null,"75.7 Handrið",{"$f":"SUMIF('Innsláttur - Vegir'!$L$6:$L161,$B64,'Innsláttur - Vegir'!W$6:W$130)","v":0},{"$f":"SUMIF('Innsláttur - Vegir'!$L$6:$L161,$B64,'Innsláttur - Vegir'!X$6:X$130)","v":0},{"$f":"SUMIF('Innsláttur - Vegir'!$L$6:$L161,$B64,'Innsláttur - Vegir'!Y$6:Y$130)","v":0},{"$f":"SUMIF('Innsláttur - Vegir'!$L$6:$L161,$B64,'Innsláttur - Vegir'!Z$6:Z$130)","v":0},{"$f":"SUMIF('Innsláttur - Vegir'!$L$6:$L161,$B64,'Innsláttur - Vegir'!AA$6:AA$130)","v":0},{"$f":"SUMIF('Innsláttur - Vegir'!$L$6:$L161,$B64,'Innsláttur - Vegir'!AB$6:AB$130)","v":0}]
[null,"Samtals",{"$f":"SUM(C35:C64)","v":0},0,0,0,0,0]

{"sheet":"Niðurstöður - Brýr","index":8,"n_rows":74,"n_cols":26,"rows_kept":74,"cut":false,"hidden":false,"merged":[[17,2,17,7],[20,11,20,15],[29,21,29,25],[32,1,32,7],[34,2,34,7],[2,21,2,23],[15,1,15,7],[3,1,3,7],[5,2,5,7],[3,11,3,16],[4,11,4,16],[5,11,5,16],[6,11,6,16],[15,11,15,12],[13,13,13,15],[16,11,16,12],[15,14,15,16],[16,14,16,16],[7,11,7,16],[8,11,8,16],[10,11,10,16],[11,11,11,16]]}
[]
[null,"Niðurstöður - Brýr",null,null,null,null,null,null,null,null,"Skýrsla - Brýr"]
[null,null,null,null,null,null,null,null,null,null,null,null,null,null,null,null,null,null,null,null,null,"kg CO2-ígildi"]
[null,"Niðurstöður kolefnisútreikninga, deilt niður á yfirverkþætti og vistferilsfasa",null,null,null,null,null,null,null,null,"Nafn verkefnis",{"$f":"IF(ISBLANK(Forsíða!D5),\"\",Forsíða!D5)","v":""},null,null,null,null,null,null,null,null,null,"Heild","Per km","per m2"]
[null,null,null,null,null,null,null,null,null,null,"Veghluti","Brýr",null,null,null,null,null,null,null,null,"A1-A3",{"$f":"L28","v":0},{"$f":"V5/($L$14/1000)","v":{"$error":"#DIV/0!"}},{"$f":"V5/$Q$14","v":{"$error":"#DIV/0!"}}]
[null,null,"kg CO2-ígildi",null,null,null,null,null,null,null,"Staðsetning",{"$f":"IF(ISBLANK(Forsíða!D6),\"\",Forsíða!D6)","v":""},null,null,null,null,null,null,null,null,"A4",{"$f":"M28","v":0},{"$f":"V6/($L$14/1000)","v":{"$error":"#DIV/0!"}},{"$f":"V6/$Q$14","v":{"$error":"#DIV/0!"}}]
[null,null,"A1-A3","A4","A5","A1-A5","B4","A1-A5 + B4",null,null,"Dagsetning greiningar",{"$f":"IF(ISBLANK(Forsíða!D7),\"\",Forsíða!D7)","v":"dd.mm.yyyy"},null,null,null,null,null,null,null,null,"A5",{"$f":"N28","v":0},{"$error":"#DIV/0!"},{"$error":"#DIV/0!"}]
[null,"Skeringar og undirbygging",{"$f":"SUMIF('Innsláttur - Brýr'!$K$6:$K$132,$B8,'Innsláttur - Brýr'!W$6:W$132)","v":0},{"$f":"SUMIF('Innsláttur - Brýr'!$K$6:$K$132,$B8,'Innsláttur - Brýr'!X$6:X$132)","v":0},{"$f":"SUMIF('Innsláttur - Brýr'!$K$6:$K$132,$B8,'Innsláttur - Brýr'!Y$6:Y$132)","v":0},{"$f":"SUMIF('Innsláttur - Brýr'!$K$6:$K$132,$B8,'Innsláttur - Brýr'!Z$6:Z$132)","v":0},{"$f":"SUMIF('Innsláttur - Brýr'!$K$6:$K$132,$B8,'Innsláttur - Brýr'!AA$6:AA$132)","v":0},{"$f":"SUMIF('Innsláttur - Brýr'!$K$6:$K$132,$B8,'Innsláttur - Brýr'!AB$6:AB$132)","v":0},null,null,"Greiningartími (ár)",{"$f":"IF(ISBLANK(Forsíða!D8),\"\",Forsíða!D8)","v":60},null,null,null,null,null,null,null,null,"B4",{"$f":"O28","v":0},{"$error":"#DIV/0!"},{"$error":"#DIV/0!"}]
[null,"Ræsi og veitur",{"$f":"SUMIF('Innsláttur - Brýr'!$K$6:$K$132,$B9,'Innsláttur - Brýr'!W$6:W$132)","v":0},{"$f":"SUMIF('Innsláttur - Brýr'!$K$6:$K$132,$B9,'Innsláttur - Brýr'!X$6:X$132)","v":0},{"$f":"SUMIF('Innsláttur - Brýr'!$K$6:$K$132,$B9,'Innsláttur - Brýr'!Y$6:Y$132)","v":0},{"$f":"SUMIF('Innsláttur - Brýr'!$K$6:$K$132,$B9,'Innsláttur - Brýr'!Z$6:Z$132)","v":0},{"$f":"SUMIF('Innsláttur - Brýr'!$K$6:$K$132,$B9,'Innsláttur - Brýr'!AA$6:AA$132)","v":0},{"$f":"SUMIF('Innsláttur - Brýr'!$K$6:$K$132,$B9,'Innsláttur - Brýr'!AB$6:AB$132)","v":0},null,null,"Unnið af",{"$f":"IF(ISBLANK(Forsíða!D9),\"\",Forsíða!D9)","v":""},null,null,null,null,null,null,null,null,"Samtals",{"$f":"SUM(V5:V8)","v":0},{"$f":"SUM(W5:W8)","v":{"$error":"#DIV/0!"}},{"$error":"#DIV/0!"}]
[null,"Slitlög",{"$f":"SUMIF('Innsláttur - Brýr'!$K$6:$K$132,$B10,'Innsláttur - Brýr'!W$6:W$132)","v":0},{"$f":"SUMIF('Innsláttur - Brýr'!$K$6:$K$132,$B10,'Innsláttur - Brýr'!X$6:X$132)","v":0},{"$f":"SUMIF('Innsláttur - Brýr'!$K$6:$K$132,$B10,'Innsláttur - Brýr'!Y$6:Y$132)","v":0},{"$f":"SUMIF('Innsláttur - Brýr'!$K$6:$K$132,$B10,'Innsláttur - Brýr'!Z$6:Z$132)","v":0},{"$f":"SUMIF('Innsláttur - Brýr'!$K$6:$K$132,$B10,'Innsláttur - Brýr'!AA$6:AA$132)","v":0},{"$f":"SUMIF('Innsláttur - Brýr'!$K$6:$K$132,$B10,'Innsláttur - Brýr'!AB$6:AB$132)","v":0}]
[null,"Öryggisbúnaður og frágangur",{"$f":"SUMIF('Innsláttur - Brýr'!$K$6:$K$132,$B11,'Innsláttur - Brýr'!W$6:W$132)","v":0},{"$f":"SUMIF('Innsláttur - Brýr'!$K$6:$K$132,$B11,'Innsláttur - Brýr'!X$6:X$132)","v":0},{"$f":"SUMIF('Innsláttur - Brýr'!$K$6:$K$132,$B11,'Innsláttur - Brýr'!Y$6:Y$132)","v":0},{"$f":"SUMIF('Innsláttur - Brýr'!$K$6:$K$132,$B11,'Innsláttur - Brýr'!Z$6:Z$132)","v":0},{"$f":"SUMIF('Innsláttur - Brýr'!$K$6:$K$132,$B11,'Innsláttur - Brýr'!AA$6:AA$132)","v":0},{"$f":"SUMIF('Innsláttur - Brýr'!$K$6:$K$132,$B11,'Innsláttur - Brýr'!AB$6:AB$132)","v":0},null,null,"Árdagsumferð (ÁDU)",{"$f":"IF(ISBLANK(Forsíða!D11),\"\",Forsíða!D11)","v":""}]
[null,"Brýr og steypt mannvirki",{"$f":"SUMIF('Innsláttur - Brýr'!$K$6:$K$132,$B12,'Innsláttur - Brýr'!W$6:W$132)","v":0},{"$f":"SUMIF('Innsláttur - Brýr'!$K$6:$K$132,$B12,'Innsláttur - Brýr'!X$6:X$132)","v":0},{"$f":"SUMIF('Innsláttur - Brýr'!$K$6:$K$132,$B12,'Innsláttur - Brýr'!Y$6:Y$132)","v":0},{"$f":"SUMIF('Innsláttur - Brýr'!$K$6:$K$132,$B12,'Innsláttur - Brýr'!Z$6:Z$132)","v":0},{"$f":"SUMIF('Innsláttur - Brýr'!$K$6:$K$132,$B12,'Innsláttur - Brýr'!AA$6:AA$132)","v":0},{"$f":"SUMIF('Innsláttur - Brýr'!$K$6:$K$132,$B12,'Innsláttur - Brýr'!AB$6:AB$132)","v":0},null,null,"Framkvæmdarstig",{"$f":"IF(ISBLANK(Forsíða!D12),\"\",Forsíða!D12)","v":"Veldu framkvæmdarstig"}]
[null,"Samtals",{"$f":"SUM(C8:C12)","v":0},0,0,0,0,0]
[null,null,null,null,null,null,null,null,null,null,"Heildarlengd brúa [m]",{"$f":"Forsíða!D15","v":0},null,"Heildarflatarmál brúa [m2]",null,null,{"$f":"Forsíða!G15","v":0}]
[]
[null,"Niðurstöður kolefnisútreikninga, skipt niður á efnisflokka og vistferilsfasa",null,null,null,null,null,null,null,null,"Útreiknað heildarkolefnisspor",{"$f":"MROUND(V9/1000,10)&\" tonn CO2-ígildi\"","v":"0 tonn CO2-ígildi"},null,"Óvissubil",{"$f":"IF(L12=Sheet2!P7,\"Engin áætluð óvissa\",MROUND(V9*_xlfn.XLOOKUP(L12,Sheet2!P3:P7,Sheet2!Q3:Q7)/1000,10)&\" - \"&MROUND(V9*_xlfn.XLOOKUP(L12,Sheet2!P3:P7,Sheet2!R3:R7)/1000,10)&\" tonn CO2-ígildi\")","v":{"$error":"#N/A"}}]
[null,null,null,null,null,null,null,null,null,null,"Útreiknað kolefnisspor á m2",{"$f":"MROUND(X9,1)&\" kg CO2-ígildi/m2\"","v":{"$error":"#DIV/0!"}},null,"Óvissubil",{"$f":"IF(L12=Sheet2!P7,\"Engin áætluð óvissa\",MROUND(V9*_xlfn.XLOOKUP(L12,Sheet2!P3:P7,Sheet2!Q3:Q7)/Q14,1)&\" - \"&MROUND(V9*_xlfn.XLOOKUP(L12,Sheet2!P3:P7,Sheet2!R3:R7)/Q14,1)&\" kg CO2-ígildi/m2\")","v":{"$error":"#N/A"}}]
[null,null,"kg CO2-ígildi"]
[null,null,"A1-A3","A4","A5","A1-A5","B4","A1-A5 + B4"]
[null,"Jarðvinna",{"$f":"SUMIF('Innsláttur - Brýr'!$I$6:$I132,$B20,'Innsláttur - Brýr'!W$6:W$132)","v":0},{"$f":"SUMIF('Innsláttur - Brýr'!$I$6:$I132,$B20,'Innsláttur - Brýr'!X$6:X$132)","v":0},{"$f":"SUMIF('Innsláttur - Brýr'!$I$6:$I132,$B20,'Innsláttur - Brýr'!Y$6:Y$132)-SUMIF('Innsláttur - Brýr'!$I$6:$I132,$B20,'Innsláttur - Brýr'!S$6:S$132)*EF_oil","v":0},{"$f":"SUM(C20:E20)","v":0},{"$f":"SUMIF('Innsláttur - Brýr'!$I$6:$I132,$B20,'Innsláttur - Brýr'!AA$6:AA$132)","v":0},{"$f":"SUMIF('Innsláttur - Brýr'!$I$6:$I132,$B20,'Innsláttur - Brýr'!AB$6:AB$132)","v":0}]
[null,"Plast",{"$f":"SUMIF('Innsláttur - Brýr'!$I$6:$I133,$B21,'Innsláttur - Brýr'!W$6:W$132)","v":0},{"$f":"SUMIF('Innsláttur - Brýr'!$I$6:$I133,$B21,'Innsláttur - Brýr'!X$6:X$132)","v":0},{"$f":"SUMIF('Innsláttur - Brýr'!$I$6:$I133,$B21,'Innsláttur - Brýr'!Y$6:Y$132)-SUMIF('Innsláttur - Brýr'!$I$6:$I133,$B21,'Innsláttur - Brýr'!S$6:S$132)*EF_oil","v":0},{"$f":"SUM(C21:E21)","v":0},{"$f":"SUMIF('Innsláttur - Brýr'!$I$6:$I133,$B21,'Innsláttur - Brýr'!AA$6:AA$132)","v":0},{"$f":"SUMIF('Innsláttur - Brýr'!$I$6:$I133,$B21,'Innsláttur - Brýr'!AB$6:AB$132)","v":0},null,null,null,"kg CO2-ígildi"]
[null,"Stál",{"$f":"SUMIF('Innsláttur - Brýr'!$I$6:$I134,$B22,'Innsláttur - Brýr'!W$6:W$132)","v":0},{"$f":"SUMIF('Innsláttur - Brýr'!$I$6:$I134,$B22,'Innsláttur - Brýr'!X$6:X$132)","v":0},{"$f":"SUMIF('Innsláttur - Brýr'!$I$6:$I134,$B22,'Innsláttur - Brýr'!Y$6:Y$132)-SUMIF('Innsláttur - Brýr'!$I$6:$I134,$B22,'Innsláttur - Brýr'!S$6:S$132)*EF_oil","v":0},0,{"$f":"SUMIF('Innsláttur - Brýr'!$I$6:$I134,$B22,'Innsláttur - Brýr'!AA$6:AA$132)","v":0},{"$f":"SUMIF('Innsláttur - Brýr'!$I$6:$I134,$B22,'Innsláttur - Brýr'!AB$6:AB$132)","v":0},null,null,null,"A1-A3","A4","A5","B4","Samtals"]
[null,"Steypa",{"$f":"SUMIF('Innsláttur - Brýr'!$I$6:$I135,$B23,'Innsláttur - Brýr'!W$6:W$132)","v":0},{"$f":"SUMIF('Innsláttur - Brýr'!$I$6:$I135,$B23,'Innsláttur - Brýr'!X$6:X$132)","v":0},{"$f":"SUMIF('Innsláttur - Brýr'!$I$6:$I135,$B23,'Innsláttur - Brýr'!Y$6:Y$132)-SUMIF('Innsláttur - Brýr'!$I$6:$I135,$B23,'Innsláttur - Brýr'!S$6:S$132)*EF_oil","v":0},0,{"$f":"SUMIF('Innsláttur - Brýr'!$I$6:$I135,$B23,'Innsláttur - Brýr'!AA$6:AA$132)","v":0},{"$f":"SUMIF('Innsláttur - Brýr'!$I$6:$I135,$B23,'Innsláttur - Brýr'!AB$6:AB$132)","v":0},null,null,"Skeringar og undirbygging",{"$f":"C8","v":0},0,0,{"$f":"G8","v":0},{"$f":"SUM(L23:O23)","v":0}]
[null,"Rafstrengur",{"$f":"SUMIF('Innsláttur - Brýr'!$I$6:$I136,$B24,'Innsláttur - Brýr'!W$6:W$132)","v":0},{"$f":"SUMIF('Innsláttur - Brýr'!$I$6:$I136,$B24,'Innsláttur - Brýr'!X$6:X$132)","v":0},{"$f":"SUMIF('Innsláttur - Brýr'!$I$6:$I136,$B24,'Innsláttur - Brýr'!Y$6:Y$132)-SUMIF('Innsláttur - Brýr'!$I$6:$I136,$B24,'Innsláttur - Brýr'!S$6:S$132)*EF_oil","v":0},0,{"$f":"SUMIF('Innsláttur - Brýr'!$I$6:$I136,$B24,'Innsláttur - Brýr'!AA$6:AA$132)","v":0},{"$f":"SUMIF('Innsláttur - Brýr'!$I$6:$I136,$B24,'Innsláttur - Brýr'!AB$6:AB$132)","v":0},null,null,"Ræsi og veitur",0,0,0,0,{"$f":"SUM(L24:O24)","v":0}]
[null,"Malbik",{"$f":"SUMIF('Innsláttur - Brýr'!$I$6:$I138,$B25,'Innsláttur - Brýr'!W$6:W$132)","v":0},{"$f":"SUMIF('Innsláttur - Brýr'!$I$6:$I138,$B25,'Innsláttur - Brýr'!X$6:X$132)","v":0},{"$f":"SUMIF('Innsláttur - Brýr'!$I$6:$I138,$B25,'Innsláttur - Brýr'!Y$6:Y$132)-SUMIF('Innsláttur - Brýr'!$I$6:$I138,$B25,'Innsláttur - Brýr'!S$6:S$132)*EF_oil","v":0},0,{"$f":"SUMIF('Innsláttur - Brýr'!$I$6:$I138,$B25,'Innsláttur - Brýr'!AA$6:AA$132)","v":0},{"$f":"SUMIF('Innsláttur - Brýr'!$I$6:$I138,$B25,'Innsláttur - Brýr'!AB$6:AB$132)","v":0},null,null,"Slitlög",0,0,0,0,0]
[null,"Timbur",{"$f":"SUMIF('Innsláttur - Brýr'!$I$6:$I139,$B26,'Innsláttur - Brýr'!W$6:W$132)","v":0},{"$f":"SUMIF('Innsláttur - Brýr'!$I$6:$I139,$B26,'Innsláttur - Brýr'!X$6:X$132)","v":0},{"$f":"SUMIF('Innsláttur - Brýr'!$I$6:$I139,$B26,'Innsláttur - Brýr'!Y$6:Y$132)-SUMIF('Innsláttur - Brýr'!$I$6:$I139,$B26,'Innsláttur - Brýr'!S$6:S$132)*EF_oil","v":0},0,{"$f":"SUMIF('Innsláttur - Brýr'!$I$6:$I139,$B26,'Innsláttur - Brýr'!AA$6:AA$132)","v":0},{"$f":"SUMIF('Innsláttur - Brýr'!$I$6:$I139,$B26,'Innsláttur - Brýr'!AB$6:AB$132)","v":0},null,null,"Öryggisbúnaður og frágangur",0,0,0,0,0]
[null,"Annað",{"$f":"SUMIF('Innsláttur - Brýr'!$I$6:$I141,$B27,'Innsláttur - Brýr'!W$6:W$132)","v":0},{"$f":"SUMIF('Innsláttur - Brýr'!$I$6:$I141,$B27,'Innsláttur - Brýr'!X$6:X$132)","v":0},{"$f":"SUMIF('Innsláttur - Brýr'!$I$6:$I141,$B27,'Innsláttur - Brýr'!Y$6:Y$132)-SUMIF('Innsláttur - Brýr'!$I$6:$I141,$B27,'Innsláttur - Brýr'!S$6:S$132)*EF_oil","v":0},0,{"$f":"SUMIF('Innsláttur - Brýr'!$I$6:$I141,$B27,'Innsláttur - Brýr'!AA$6:AA$132)","v":0},{"$f":"SUMIF('Innsláttur - Brýr'!$I$6:$I141,$B27,'Innsláttur - Brýr'!AB$6:AB$132)","v":0},null,null,"Brýr og steypt mannvirki",0,0,0,0,0]
[null,"Gúmmí",{"$f":"SUMIF('Innsláttur - Brýr'!$I$6:$I142,$B28,'Innsláttur - Brýr'!W$6:W$132)","v":0},{"$f":"SUMIF('Innsláttur - Brýr'!$I$6:$I142,$B28,'Innsláttur - Brýr'!X$6:X$132)","v":0},{"$f":"SUMIF('Innsláttur - Brýr'!$I$6:$I142,$B28,'Innsláttur - Brýr'!Y$6:Y$132)-SUMIF('Innsláttur - Brýr'!$I$6:$I142,$B28,'Innsláttur - Brýr'!S$6:S$132)*EF_oil","v":0},0,{"$f":"SUMIF('Innsláttur - Brýr'!$I$6:$I142,$B28,'Innsláttur - Brýr'!AA$6:AA$132)","v":0},{"$f":"SUMIF('Innsláttur - Brýr'!$I$6:$I142,$B28,'Innsláttur - Brýr'!AB$6:AB$132)","v":0},null,null,"Samtals",{"$f":"SUM(L23:L27)","v":0},{"$f":"SUM(M23:M27)","v":0},{"$f":"SUM(N23:N27)","v":0},0,0]
[null,"Dísilolíunotkun á verkstað",{"$f":"SUMIF('Innsláttur - Brýr'!$I$6:$I143,$B29,'Innsláttur - Brýr'!W$6:W$132)","v":0},{"$f":"SUMIF('Innsláttur - Brýr'!$I$6:$I143,$B29,'Innsláttur - Brýr'!X$6:X$132)","v":0},{"$f":"'Innsláttur - Brýr'!S121*EF_oil","v":0},0,{"$f":"SUMIF('Innsláttur - Brýr'!$I$6:$I143,$B29,'Innsláttur - Brýr'!AA$6:AA$132)","v":0},{"$f":"SUMIF('Innsláttur - Brýr'!$I$6:$I143,$B29,'Innsláttur - Brýr'!AB$6:AB$132)","v":0}]
[null,"Samtals",{"$f":"SUM(C20:C29)","v":0},0,0,0,0,0,null,null,null,null,null,null,null,null,null,null,null,null,null,"kg CO2-ígildi"]
[null,null,null,null,null,null,null,null,null,null,null,null,null,null,null,null,null,null,null,null,null,"A1-A3","A4","A5","B4","Samtals"]
[null,null,null,null,null,null,null,null,null,null,null,null,null,null,null,null,null,null,null,null,"Jarðvinna",{"$f":"C20","v":0},{"$f":"D20","v":0},{"$f":"E20","v":0},{"$f":"G20","v":0},{"$f":"SUM(V32:Y32)","v":0}]
[null,"Niðurstöður kolefnisútreikninga, deilt niður á undirverkþætti og vistferilsfasa",null,null,null,null,null,null,null,null,null,null,null,null,null,null,null,null,null,null,"Plast",0,0,0,0,0]
[null,null,null,null,null,null,null,null,null,null,null,null,null,null,null,null,null,null,null,null,"Stál",0,0,0,0,0]
[null,null,"kg CO2-ígildi",null,null,null,null,null,null,null,null,null,null,null,null,null,null,null,null,null,"Steypa",0,0,0,0,0]
[null,null,"A1-A3","A4","A5","A1-A5","B4","A1-A5 + B4",null,null,null,null,null,null,null,null,null,null,null,null,"Rafstrengur",0,0,0,0,0]
[null,"32.1 Bergskeringar í vegstæði",{"$f":"SUMIF('Innsláttur - Brýr'!$L$6:$L132,$B37,'Innsláttur - Brýr'!W$6:W$132)","v":0},{"$f":"SUMIF('Innsláttur - Brýr'!$L$6:$L132,$B37,'Innsláttur - Brýr'!X$6:X$132)","v":0},{"$f":"SUMIF('Innsláttur - Brýr'!$L$6:$L132,$B37,'Innsláttur - Brýr'!Y$6:Y$132)","v":0},{"$f":"SUMIF('Innsláttur - Brýr'!$L$6:$L132,$B37,'Innsláttur - Brýr'!Z$6:Z$132)","v":0},{"$f":"SUMIF('Innsláttur - Brýr'!$L$6:$L132,$B37,'Innsláttur - Brýr'!AA$6:AA$132)","v":0},{"$f":"SUMIF('Innsláttur - Brýr'!$L$6:$L132,$B37,'Innsláttur - Brýr'!AB$6:AB$132)","v":0},null,null,null,null,null,null,null,null,null,null,null,null,"Malbik",0,0,0,0,0]
[null,"32.2 Bergskeringar í námu",{"$f":"SUMIF('Innsláttur - Brýr'!$L$6:$L133,$B38,'Innsláttur - Brýr'!W$6:W$132)","v":0},{"$f":"SUMIF('Innsláttur - Brýr'!$L$6:$L133,$B38,'Innsláttur - Brýr'!X$6:X$132)","v":0},{"$f":"SUMIF('Innsláttur - Brýr'!$L$6:$L133,$B38,'Innsláttur - Brýr'!Y$6:Y$132)","v":0},{"$f":"SUMIF('Innsláttur - Brýr'!$L$6:$L133,$B38,'Innsláttur - Brýr'!Z$6:Z$132)","v":0},{"$f":"SUMIF('Innsláttur - Brýr'!$L$6:$L133,$B38,'Innsláttur - Brýr'!AA$6:AA$132)","v":0},{"$f":"SUMIF('Innsláttur - Brýr'!$L$6:$L133,$B38,'Innsláttur - Brýr'!AB$6:AB$132)","v":0},null,null,null,null,null,null,null,null,null,null,null,null,"Timbur",0,0,0,0,0]
[null,"33.1 Fyllingarefni úr skeringum",{"$f":"SUMIF('Innsláttur - Brýr'!$L$6:$L134,$B39,'Innsláttur - Brýr'!W$6:W$132)","v":0},{"$f":"SUMIF('Innsláttur - Brýr'!$L$6:$L134,$B39,'Innsláttur - Brýr'!X$6:X$132)","v":0},{"$f":"SUMIF('Innsláttur - Brýr'!$L$6:$L134,$B39,'Innsláttur - Brýr'!Y$6:Y$132)","v":0},{"$f":"SUMIF('Innsláttur - Brýr'!$L$6:$L134,$B39,'Innsláttur - Brýr'!Z$6:Z$132)","v":0},{"$f":"SUMIF('Innsláttur - Brýr'!$L$6:$L134,$B39,'Innsláttur - Brýr'!AA$6:AA$132)","v":0},{"$f":"SUMIF('Innsláttur - Brýr'!$L$6:$L134,$B39,'Innsláttur - Brýr'!AB$6:AB$132)","v":0},null,null,null,null,null,null,null,null,null,null,null,null,"Annað",0,0,0,0,0]
[null,"33.2 Fyllingarefni úr námu",{"$f":"SUMIF('Innsláttur - Brýr'!$L$6:$L135,$B40,'Innsláttur - Brýr'!W$6:W$132)","v":0},{"$f":"SUMIF('Innsláttur - Brýr'!$L$6:$L135,$B40,'Innsláttur - Brýr'!X$6:X$132)","v":0},{"$f":"SUMIF('Innsláttur - Brýr'!$L$6:$L135,$B40,'Innsláttur - Brýr'!Y$6:Y$132)","v":0},{"$f":"SUMIF('Innsláttur - Brýr'!$L$6:$L135,$B40,'Innsláttur - Brýr'!Z$6:Z$132)","v":0},{"$f":"SUMIF('Innsláttur - Brýr'!$L$6:$L135,$B40,'Innsláttur - Brýr'!AA$6:AA$132)","v":0},{"$f":"SUMIF('Innsláttur - Brýr'!$L$6:$L135,$B40,'Innsláttur - Brýr'!AB$6:AB$132)","v":0},null,null,null,null,null,null,null,null,null,null,null,null,"Gúmmí",0,0,0,0,0]
[null,"34.1 Fláafleygar, efni úr skeringum",{"$f":"SUMIF('Innsláttur - Brýr'!$L$6:$L136,$B41,'Innsláttur - Brýr'!W$6:W$132)","v":0},{"$f":"SUMIF('Innsláttur - Brýr'!$L$6:$L136,$B41,'Innsláttur - Brýr'!X$6:X$132)","v":0},{"$f":"SUMIF('Innsláttur - Brýr'!$L$6:$L136,$B41,'Innsláttur - Brýr'!Y$6:Y$132)","v":0},{"$f":"SUMIF('Innsláttur - Brýr'!$L$6:$L136,$B41,'Innsláttur - Brýr'!Z$6:Z$132)","v":0},{"$f":"SUMIF('Innsláttur - Brýr'!$L$6:$L136,$B41,'Innsláttur - Brýr'!AA$6:AA$132)","v":0},{"$f":"SUMIF('Innsláttur - Brýr'!$L$6:$L136,$B41,'Innsláttur - Brýr'!AB$6:AB$132)","v":0},null,null,null,null,null,null,null,null,null,null,null,null,"Dísilolíunotkun á verkstað",0,0,0,0,0]
[null,"34.8 Ónothæfu efni jafnað á losunarstað",{"$f":"SUMIF('Innsláttur - Brýr'!$L$6:$L137,$B42,'Innsláttur - Brýr'!W$6:W$132)","v":0},{"$f":"SUMIF('Innsláttur - Brýr'!$L$6:$L137,$B42,'Innsláttur - Brýr'!X$6:X$132)","v":0},{"$f":"SUMIF('Innsláttur - Brýr'!$L$6:$L137,$B42,'Innsláttur - Brýr'!Y$6:Y$132)","v":0},{"$f":"SUMIF('Innsláttur - Brýr'!$L$6:$L137,$B42,'Innsláttur - Brýr'!Z$6:Z$132)","v":0},{"$f":"SUMIF('Innsláttur - Brýr'!$L$6:$L137,$B42,'Innsláttur - Brýr'!AA$6:AA$132)","v":0},{"$f":"SUMIF('Innsláttur - Brýr'!$L$6:$L137,$B42,'Innsláttur - Brýr'!AB$6:AB$132)","v":0},null,null,null,null,null,null,null,null,null,null,null,null,"Samtals",{"$f":"SUM(V32:V41)","v":0},{"$f":"SUM(W32:W41)","v":0},{"$f":"SUM(X32:X41)","v":0},{"$f":"SUM(Y32:Y41)","v":0},{"$f":"SUM(V42:Y42)","v":0}]
[null,"36.2 Grjótvörn",{"$f":"SUMIF('Innsláttur - Brýr'!$L$6:$L139,$B43,'Innsláttur - Brýr'!W$6:W$132)","v":0},{"$f":"SUMIF('Innsláttur - Brýr'!$L$6:$L139,$B43,'Innsláttur - Brýr'!X$6:X$132)","v":0},{"$f":"SUMIF('Innsláttur - Brýr'!$L$6:$L139,$B43,'Innsláttur - Brýr'!Y$6:Y$132)","v":0},{"$f":"SUMIF('Innsláttur - Brýr'!$L$6:$L139,$B43,'Innsláttur - Brýr'!Z$6:Z$132)","v":0},{"$f":"SUMIF('Innsláttur - Brýr'!$L$6:$L139,$B43,'Innsláttur - Brýr'!AA$6:AA$132)","v":0},{"$f":"SUMIF('Innsláttur - Brýr'!$L$6:$L139,$B43,'Innsláttur - Brýr'!AB$6:AB$132)","v":0}]
[null,"42.3 Plaströr, fráveita",{"$f":"SUMIF('Innsláttur - Brýr'!$L$6:$L145,$B44,'Innsláttur - Brýr'!W$6:W$132)","v":0},{"$f":"SUMIF('Innsláttur - Brýr'!$L$6:$L145,$B44,'Innsláttur - Brýr'!X$6:X$132)","v":0},{"$f":"SUMIF('Innsláttur - Brýr'!$L$6:$L145,$B44,'Innsláttur - Brýr'!Y$6:Y$132)","v":0},{"$f":"SUMIF('Innsláttur - Brýr'!$L$6:$L145,$B44,'Innsláttur - Brýr'!Z$6:Z$132)","v":0},{"$f":"SUMIF('Innsláttur - Brýr'!$L$6:$L145,$B44,'Innsláttur - Brýr'!AA$6:AA$132)","v":0},{"$f":"SUMIF('Innsláttur - Brýr'!$L$6:$L145,$B44,'Innsláttur - Brýr'!AB$6:AB$132)","v":0}]
[null,"45.5 Brunnar",{"$f":"SUMIF('Innsláttur - Brýr'!$L$6:$L146,$B45,'Innsláttur - Brýr'!W$6:W$132)","v":0},{"$f":"SUMIF('Innsláttur - Brýr'!$L$6:$L146,$B45,'Innsláttur - Brýr'!X$6:X$132)","v":0},{"$f":"SUMIF('Innsláttur - Brýr'!$L$6:$L146,$B45,'Innsláttur - Brýr'!Y$6:Y$132)","v":0},{"$f":"SUMIF('Innsláttur - Brýr'!$L$6:$L146,$B45,'Innsláttur - Brýr'!Z$6:Z$132)","v":0},{"$f":"SUMIF('Innsláttur - Brýr'!$L$6:$L146,$B45,'Innsláttur - Brýr'!AA$6:AA$132)","v":0},{"$f":"SUMIF('Innsláttur - Brýr'!$L$6:$L146,$B45,'Innsláttur - Brýr'!AB$6:AB$132)","v":0}]
[null,"45.6 Niðurföll / sandfang",{"$f":"SUMIF('Innsláttur - Brýr'!$L$6:$L147,$B46,'Innsláttur - Brýr'!W$6:W$132)","v":0},{"$f":"SUMIF('Innsláttur - Brýr'!$L$6:$L147,$B46,'Innsláttur - Brýr'!X$6:X$132)","v":0},{"$f":"SUMIF('Innsláttur - Brýr'!$L$6:$L147,$B46,'Innsláttur - Brýr'!Y$6:Y$132)","v":0},{"$f":"SUMIF('Innsláttur - Brýr'!$L$6:$L147,$B46,'Innsláttur - Brýr'!Z$6:Z$132)","v":0},{"$f":"SUMIF('Innsláttur - Brýr'!$L$6:$L147,$B46,'Innsláttur - Brýr'!AA$6:AA$132)","v":0},{"$f":"SUMIF('Innsláttur - Brýr'!$L$6:$L147,$B46,'Innsláttur - Brýr'!AB$6:AB$132)","v":0}]
[null,"45.68 Grjótsvelgur",{"$f":"SUMIF('Innsláttur - Brýr'!$L$6:$L151,$B47,'Innsláttur - Brýr'!W$6:W$132)","v":0},{"$f":"SUMIF('Innsláttur - Brýr'!$L$6:$L151,$B47,'Innsláttur - Brýr'!X$6:X$132)","v":0},{"$f":"SUMIF('Innsláttur - Brýr'!$L$6:$L151,$B47,'Innsláttur - Brýr'!Y$6:Y$132)","v":0},{"$f":"SUMIF('Innsláttur - Brýr'!$L$6:$L151,$B47,'Innsláttur - Brýr'!Z$6:Z$132)","v":0},{"$f":"SUMIF('Innsláttur - Brýr'!$L$6:$L151,$B47,'Innsláttur - Brýr'!AA$6:AA$132)","v":0},{"$f":"SUMIF('Innsláttur - Brýr'!$L$6:$L151,$B47,'Innsláttur - Brýr'!AB$6:AB$132)","v":0}]
[null,"45.1 + 45.8 Gröftur lagnaskurða og fylling í skurði",{"$f":"SUMIF('Innsláttur - Brýr'!$L$6:$L152,$B48,'Innsláttur - Brýr'!W$6:W$132)","v":0},{"$f":"SUMIF('Innsláttur - Brýr'!$L$6:$L152,$B48,'Innsláttur - Brýr'!X$6:X$132)","v":0},{"$f":"SUMIF('Innsláttur - Brýr'!$L$6:$L152,$B48,'Innsláttur - Brýr'!Y$6:Y$132)","v":0},{"$f":"SUMIF('Innsláttur - Brýr'!$L$6:$L152,$B48,'Innsláttur - Brýr'!Z$6:Z$132)","v":0},{"$f":"SUMIF('Innsláttur - Brýr'!$L$6:$L152,$B48,'Innsláttur - Brýr'!AA$6:AA$132)","v":0},{"$f":"SUMIF('Innsláttur - Brýr'!$L$6:$L152,$B48,'Innsláttur - Brýr'!AB$6:AB$132)","v":0}]
[null,"Rafstrengir",{"$f":"SUMIF('Innsláttur - Brýr'!$L$6:$L153,$B49,'Innsláttur - Brýr'!W$6:W$132)","v":0},{"$f":"SUMIF('Innsláttur - Brýr'!$L$6:$L153,$B49,'Innsláttur - Brýr'!X$6:X$132)","v":0},{"$f":"SUMIF('Innsláttur - Brýr'!$L$6:$L153,$B49,'Innsláttur - Brýr'!Y$6:Y$132)","v":0},{"$f":"SUMIF('Innsláttur - Brýr'!$L$6:$L153,$B49,'Innsláttur - Brýr'!Z$6:Z$132)","v":0},{"$f":"SUMIF('Innsláttur - Brýr'!$L$6:$L153,$B49,'Innsláttur - Brýr'!AA$6:AA$132)","v":0},{"$f":"SUMIF('Innsláttur - Brýr'!$L$6:$L153,$B49,'Innsláttur - Brýr'!AB$6:AB$132)","v":0}]
[null,"63.42 Burðarlagsmalbik",{"$f":"SUMIF('Innsláttur - Brýr'!$L$6:$L154,$B50,'Innsláttur - Brýr'!W$6:W$132)","v":0},{"$f":"SUMIF('Innsláttur - Brýr'!$L$6:$L154,$B50,'Innsláttur - Brýr'!X$6:X$132)","v":0},{"$f":"SUMIF('Innsláttur - Brýr'!$L$6:$L154,$B50,'Innsláttur - Brýr'!Y$6:Y$132)","v":0},{"$f":"SUMIF('Innsláttur - Brýr'!$L$6:$L154,$B50,'Innsláttur - Brýr'!Z$6:Z$132)","v":0},{"$f":"SUMIF('Innsláttur - Brýr'!$L$6:$L154,$B50,'Innsláttur - Brýr'!AA$6:AA$132)","v":0},{"$f":"SUMIF('Innsláttur - Brýr'!$L$6:$L154,$B50,'Innsláttur - Brýr'!AB$6:AB$132)","v":0}]
[null,"63.43 Slitlagsmalbik",{"$f":"SUMIF('Innsláttur - Brýr'!$L$6:$L155,$B51,'Innsláttur - Brýr'!W$6:W$132)","v":0},{"$f":"SUMIF('Innsláttur - Brýr'!$L$6:$L155,$B51,'Innsláttur - Brýr'!X$6:X$132)","v":0},{"$f":"SUMIF('Innsláttur - Brýr'!$L$6:$L155,$B51,'Innsláttur - Brýr'!Y$6:Y$132)","v":0},{"$f":"SUMIF('Innsláttur - Brýr'!$L$6:$L155,$B51,'Innsláttur - Brýr'!Z$6:Z$132)","v":0},{"$f":"SUMIF('Innsláttur - Brýr'!$L$6:$L155,$B51,'Innsláttur - Brýr'!AA$6:AA$132)","v":0},{"$f":"SUMIF('Innsláttur - Brýr'!$L$6:$L155,$B51,'Innsláttur - Brýr'!AB$6:AB$132)","v":0}]
[null,"68.24 Steypt gangstétt",{"$f":"SUMIF('Innsláttur - Brýr'!$L$6:$L156,$B52,'Innsláttur - Brýr'!W$6:W$132)","v":0},{"$f":"SUMIF('Innsláttur - Brýr'!$L$6:$L156,$B52,'Innsláttur - Brýr'!X$6:X$132)","v":0},{"$f":"SUMIF('Innsláttur - Brýr'!$L$6:$L156,$B52,'Innsláttur - Brýr'!Y$6:Y$132)","v":0},{"$f":"SUMIF('Innsláttur - Brýr'!$L$6:$L156,$B52,'Innsláttur - Brýr'!Z$6:Z$132)","v":0},{"$f":"SUMIF('Innsláttur - Brýr'!$L$6:$L156,$B52,'Innsláttur - Brýr'!AA$6:AA$132)","v":0},{"$f":"SUMIF('Innsláttur - Brýr'!$L$6:$L156,$B52,'Innsláttur - Brýr'!AB$6:AB$132)","v":0}]
[null,"68.25 Gangstígar/eyjarhringtorg með hellum",{"$f":"SUMIF('Innsláttur - Brýr'!$L$6:$L157,$B53,'Innsláttur - Brýr'!W$6:W$132)","v":0},{"$f":"SUMIF('Innsláttur - Brýr'!$L$6:$L157,$B53,'Innsláttur - Brýr'!X$6:X$132)","v":0},{"$f":"SUMIF('Innsláttur - Brýr'!$L$6:$L157,$B53,'Innsláttur - Brýr'!Y$6:Y$132)","v":0},{"$f":"SUMIF('Innsláttur - Brýr'!$L$6:$L157,$B53,'Innsláttur - Brýr'!Z$6:Z$132)","v":0},{"$f":"SUMIF('Innsláttur - Brýr'!$L$6:$L157,$B53,'Innsláttur - Brýr'!AA$6:AA$132)","v":0},{"$f":"SUMIF('Innsláttur - Brýr'!$L$6:$L157,$B53,'Innsláttur - Brýr'!AB$6:AB$132)","v":0}]
[null,"75.1 Kantsteinar",{"$f":"SUMIF('Innsláttur - Brýr'!$L$6:$L158,$B54,'Innsláttur - Brýr'!W$6:W$132)","v":0},{"$f":"SUMIF('Innsláttur - Brýr'!$L$6:$L158,$B54,'Innsláttur - Brýr'!X$6:X$132)","v":0},{"$f":"SUMIF('Innsláttur - Brýr'!$L$6:$L158,$B54,'Innsláttur - Brýr'!Y$6:Y$132)","v":0},{"$f":"SUMIF('Innsláttur - Brýr'!$L$6:$L158,$B54,'Innsláttur - Brýr'!Z$6:Z$132)","v":0},{"$f":"SUMIF('Innsláttur - Brýr'!$L$6:$L158,$B54,'Innsláttur - Brýr'!AA$6:AA$132)","v":0},{"$f":"SUMIF('Innsláttur - Brýr'!$L$6:$L158,$B54,'Innsláttur - Brýr'!AB$6:AB$132)","v":0}]
[null,"75.2 Eyjar og hringtorg",{"$f":"SUMIF('Innsláttur - Brýr'!$L$6:$L159,$B55,'Innsláttur - Brýr'!W$6:W$132)","v":0},{"$f":"SUMIF('Innsláttur - Brýr'!$L$6:$L159,$B55,'Innsláttur - Brýr'!X$6:X$132)","v":0},{"$f":"SUMIF('Innsláttur - Brýr'!$L$6:$L159,$B55,'Innsláttur - Brýr'!Y$6:Y$132)","v":0},{"$f":"SUMIF('Innsláttur - Brýr'!$L$6:$L159,$B55,'Innsláttur - Brýr'!Z$6:Z$132)","v":0},{"$f":"SUMIF('Innsláttur - Brýr'!$L$6:$L159,$B55,'Innsláttur - Brýr'!AA$6:AA$132)","v":0},{"$f":"SUMIF('Innsláttur - Brýr'!$L$6:$L159,$B55,'Innsláttur - Brýr'!AB$6:AB$132)","v":0}]
[null,"75.6 Vegrið",{"$f":"SUMIF('Innsláttur - Brýr'!$L$6:$L160,$B56,'Innsláttur - Brýr'!W$6:W$132)","v":0},{"$f":"SUMIF('Innsláttur - Brýr'!$L$6:$L160,$B56,'Innsláttur - Brýr'!X$6:X$132)","v":0},{"$f":"SUMIF('Innsláttur - Brýr'!$L$6:$L160,$B56,'Innsláttur - Brýr'!Y$6:Y$132)","v":0},{"$f":"SUMIF('Innsláttur - Brýr'!$L$6:$L160,$B56,'Innsláttur - Brýr'!Z$6:Z$132)","v":0},{"$f":"SUMIF('Innsláttur - Brýr'!$L$6:$L160,$B56,'Innsláttur - Brýr'!AA$6:AA$132)","v":0},{"$f":"SUMIF('Innsláttur - Brýr'!$L$6:$L160,$B56,'Innsláttur - Brýr'!AB$6:AB$132)","v":0}]
[null,"76.45 Ljósastuarar",{"$f":"SUMIF('Innsláttur - Brýr'!$L$6:$L161,$B57,'Innsláttur - Brýr'!W$6:W$132)","v":0},{"$f":"SUMIF('Innsláttur - Brýr'!$L$6:$L161,$B57,'Innsláttur - Brýr'!X$6:X$132)","v":0},{"$f":"SUMIF('Innsláttur - Brýr'!$L$6:$L161,$B57,'Innsláttur - Brýr'!Y$6:Y$132)","v":0},{"$f":"SUMIF('Innsláttur - Brýr'!$L$6:$L161,$B57,'Innsláttur - Brýr'!Z$6:Z$132)","v":0},{"$f":"SUMIF('Innsláttur - Brýr'!$L$6:$L161,$B57,'Innsláttur - Brýr'!AA$6:AA$132)","v":0},{"$f":"SUMIF('Innsláttur - Brýr'!$L$6:$L161,$B57,'Innsláttur - Brýr'!AB$6:AB$132)","v":0}]
[null,"75.62 Vegrið á brú",{"$f":"SUMIF('Innsláttur - Brýr'!$L$6:$L162,$B58,'Innsláttur - Brýr'!W$6:W$132)","v":0},{"$f":"SUMIF('Innsláttur - Brýr'!$L$6:$L162,$B58,'Innsláttur - Brýr'!X$6:X$132)","v":0},{"$f":"SUMIF('Innsláttur - Brýr'!$L$6:$L162,$B58,'Innsláttur - Brýr'!Y$6:Y$132)","v":0},{"$f":"SUMIF('Innsláttur - Brýr'!$L$6:$L162,$B58,'Innsláttur - Brýr'!Z$6:Z$132)","v":0},{"$f":"SUMIF('Innsláttur - Brýr'!$L$6:$L162,$B58,'Innsláttur - Brýr'!AA$6:AA$132)","v":0},{"$f":"SUMIF('Innsláttur - Brýr'!$L$6:$L162,$B58,'Innsláttur - Brýr'!AB$6:AB$132)","v":0}]
[null,"75.7 Handrið",{"$f":"SUMIF('Innsláttur - Brýr'!$L$6:$L163,$B59,'Innsláttur - Brýr'!W$6:W$132)","v":0},{"$f":"SUMIF('Innsláttur - Brýr'!$L$6:$L163,$B59,'Innsláttur - Brýr'!X$6:X$132)","v":0},{"$f":"SUMIF('Innsláttur - Brýr'!$L$6:$L163,$B59,'Innsláttur - Brýr'!Y$6:Y$132)","v":0},{"$f":"SUMIF('Innsláttur - Brýr'!$L$6:$L163,$B59,'Innsláttur - Brýr'!Z$6:Z$132)","v":0},{"$f":"SUMIF('Innsláttur - Brýr'!$L$6:$L163,$B59,'Innsláttur - Brýr'!AA$6:AA$132)","v":0},{"$f":"SUMIF('Innsláttur - Brýr'!$L$6:$L163,$B59,'Innsláttur - Brýr'!AB$6:AB$132)","v":0}]
[null,"81.31 Fylling við steypt mannvirki",{"$f":"SUMIF('Innsláttur - Brýr'!$L$6:$L164,$B60,'Innsláttur - Brýr'!W$6:W$132)","v":0},{"$f":"SUMIF('Innsláttur - Brýr'!$L$6:$L164,$B60,'Innsláttur - Brýr'!X$6:X$132)","v":0},{"$f":"SUMIF('Innsláttur - Brýr'!$L$6:$L164,$B60,'Innsláttur - Brýr'!Y$6:Y$132)","v":0},{"$f":"SUMIF('Innsláttur - Brýr'!$L$6:$L164,$B60,'Innsláttur - Brýr'!Z$6:Z$132)","v":0},{"$f":"SUMIF('Innsláttur - Brýr'!$L$6:$L164,$B60,'Innsláttur - Brýr'!AA$6:AA$132)","v":0},{"$f":"SUMIF('Innsláttur - Brýr'!$L$6:$L164,$B60,'Innsláttur - Brýr'!AB$6:AB$132)","v":0}]
[null,"83.11 Bergboltar",{"$f":"SUMIF('Innsláttur - Brýr'!$L$6:$L164,$B61,'Innsláttur - Brýr'!W$6:W$132)","v":0},{"$f":"SUMIF('Innsláttur - Brýr'!$L$6:$L164,$B61,'Innsláttur - Brýr'!X$6:X$132)","v":0},{"$f":"SUMIF('Innsláttur - Brýr'!$L$6:$L164,$B61,'Innsláttur - Brýr'!Y$6:Y$132)","v":0},{"$f":"SUMIF('Innsláttur - Brýr'!$L$6:$L164,$B61,'Innsláttur - Brýr'!Z$6:Z$132)","v":0},{"$f":"SUMIF('Innsláttur - Brýr'!$L$6:$L164,$B61,'Innsláttur - Brýr'!AA$6:AA$132)","v":0},{"$f":"SUMIF('Innsláttur - Brýr'!$L$6:$L164,$B61,'Innsláttur - Brýr'!AB$6:AB$132)","v":0}]
[null,"83.212 Steyptir staurar",{"$f":"SUMIF('Innsláttur - Brýr'!$L$6:$L165,$B62,'Innsláttur - Brýr'!W$6:W$132)","v":0},{"$f":"SUMIF('Innsláttur - Brýr'!$L$6:$L165,$B62,'Innsláttur - Brýr'!X$6:X$132)","v":0},{"$f":"SUMIF('Innsláttur - Brýr'!$L$6:$L165,$B62,'Innsláttur - Brýr'!Y$6:Y$132)","v":0},{"$f":"SUMIF('Innsláttur - Brýr'!$L$6:$L165,$B62,'Innsláttur - Brýr'!Z$6:Z$132)","v":0},{"$f":"SUMIF('Innsláttur - Brýr'!$L$6:$L165,$B62,'Innsláttur - Brýr'!AA$6:AA$132)","v":0},{"$f":"SUMIF('Innsláttur - Brýr'!$L$6:$L165,$B62,'Innsláttur - Brýr'!AB$6:AB$132)","v":0}]
[null,"83.222 Tréstaurar",{"$f":"SUMIF('Innsláttur - Brýr'!$L$6:$L166,$B63,'Innsláttur - Brýr'!W$6:W$132)","v":0},{"$f":"SUMIF('Innsláttur - Brýr'!$L$6:$L166,$B63,'Innsláttur - Brýr'!X$6:X$132)","v":0},{"$f":"SUMIF('Innsláttur - Brýr'!$L$6:$L166,$B63,'Innsláttur - Brýr'!Y$6:Y$132)","v":0},{"$f":"SUMIF('Innsláttur - Brýr'!$L$6:$L166,$B63,'Innsláttur - Brýr'!Z$6:Z$132)","v":0},{"$f":"SUMIF('Innsláttur - Brýr'!$L$6:$L166,$B63,'Innsláttur - Brýr'!AA$6:AA$132)","v":0},{"$f":"SUMIF('Innsláttur - Brýr'!$L$6:$L166,$B63,'Innsláttur - Brýr'!AB$6:AB$132)","v":0}]
[null,"83.232 Stálstaurar",{"$f":"SUMIF('Innsláttur - Brýr'!$L$6:$L167,$B64,'Innsláttur - Brýr'!W$6:W$132)","v":0},{"$f":"SUMIF('Innsláttur - Brýr'!$L$6:$L167,$B64,'Innsláttur - Brýr'!X$6:X$132)","v":0},{"$f":"SUMIF('Innsláttur - Brýr'!$L$6:$L167,$B64,'Innsláttur - Brýr'!Y$6:Y$132)","v":0},{"$f":"SUMIF('Innsláttur - Brýr'!$L$6:$L167,$B64,'Innsláttur - Brýr'!Z$6:Z$132)","v":0},{"$f":"SUMIF('Innsláttur - Brýr'!$L$6:$L167,$B64,'Innsláttur - Brýr'!AA$6:AA$132)","v":0},{"$f":"SUMIF('Innsláttur - Brýr'!$L$6:$L167,$B64,'Innsláttur - Brýr'!AB$6:AB$132)","v":0}]
[null,"83.6 Stálþil",{"$f":"SUMIF('Innsláttur - Brýr'!$L$6:$L168,$B65,'Innsláttur - Brýr'!W$6:W$132)","v":0},{"$f":"SUMIF('Innsláttur - Brýr'!$L$6:$L168,$B65,'Innsláttur - Brýr'!X$6:X$132)","v":0},{"$f":"SUMIF('Innsláttur - Brýr'!$L$6:$L168,$B65,'Innsláttur - Brýr'!Y$6:Y$132)","v":0},{"$f":"SUMIF('Innsláttur - Brýr'!$L$6:$L168,$B65,'Innsláttur - Brýr'!Z$6:Z$132)","v":0},{"$f":"SUMIF('Innsláttur - Brýr'!$L$6:$L168,$B65,'Innsláttur - Brýr'!AA$6:AA$132)","v":0},{"$f":"SUMIF('Innsláttur - Brýr'!$L$6:$L168,$B65,'Innsláttur - Brýr'!AB$6:AB$132)","v":0}]
[null,"84.2 Mót",{"$f":"SUMIF('Innsláttur - Brýr'!$L$6:$L169,$B66,'Innsláttur - Brýr'!W$6:W$132)","v":0},{"$f":"SUMIF('Innsláttur - Brýr'!$L$6:$L169,$B66,'Innsláttur - Brýr'!X$6:X$132)","v":0},{"$f":"SUMIF('Innsláttur - Brýr'!$L$6:$L169,$B66,'Innsláttur - Brýr'!Y$6:Y$132)","v":0},{"$f":"SUMIF('Innsláttur - Brýr'!$L$6:$L169,$B66,'Innsláttur - Brýr'!Z$6:Z$132)","v":0},{"$f":"SUMIF('Innsláttur - Brýr'!$L$6:$L169,$B66,'Innsláttur - Brýr'!AA$6:AA$132)","v":0},{"$f":"SUMIF('Innsláttur - Brýr'!$L$6:$L169,$B66,'Innsláttur - Brýr'!AB$6:AB$132)","v":0}]
[null,"84.31 Slakbent járnalögn",{"$f":"SUMIF('Innsláttur - Brýr'!$L$6:$L170,$B67,'Innsláttur - Brýr'!W$6:W$132)","v":0},{"$f":"SUMIF('Innsláttur - Brýr'!$L$6:$L170,$B67,'Innsláttur - Brýr'!X$6:X$132)","v":0},{"$f":"SUMIF('Innsláttur - Brýr'!$L$6:$L170,$B67,'Innsláttur - Brýr'!Y$6:Y$132)","v":0},{"$f":"SUMIF('Innsláttur - Brýr'!$L$6:$L170,$B67,'Innsláttur - Brýr'!Z$6:Z$132)","v":0},{"$f":"SUMIF('Innsláttur - Brýr'!$L$6:$L170,$B67,'Innsláttur - Brýr'!AA$6:AA$132)","v":0},{"$f":"SUMIF('Innsláttur - Brýr'!$L$6:$L170,$B67,'Innsláttur - Brýr'!AB$6:AB$132)","v":0}]
[null,"84.36 Eftirspennt járnalögn",{"$f":"SUMIF('Innsláttur - Brýr'!$L$6:$L171,$B68,'Innsláttur - Brýr'!W$6:W$132)","v":0},{"$f":"SUMIF('Innsláttur - Brýr'!$L$6:$L171,$B68,'Innsláttur - Brýr'!X$6:X$132)","v":0},{"$f":"SUMIF('Innsláttur - Brýr'!$L$6:$L171,$B68,'Innsláttur - Brýr'!Y$6:Y$132)","v":0},{"$f":"SUMIF('Innsláttur - Brýr'!$L$6:$L171,$B68,'Innsláttur - Brýr'!Z$6:Z$132)","v":0},{"$f":"SUMIF('Innsláttur - Brýr'!$L$6:$L171,$B68,'Innsláttur - Brýr'!AA$6:AA$132)","v":0},{"$f":"SUMIF('Innsláttur - Brýr'!$L$6:$L171,$B68,'Innsláttur - Brýr'!AB$6:AB$132)","v":0}]
[null,"84.4 Steypa",{"$f":"SUMIF('Innsláttur - Brýr'!$L$6:$L172,$B69,'Innsláttur - Brýr'!W$6:W$132)","v":0},{"$f":"SUMIF('Innsláttur - Brýr'!$L$6:$L172,$B69,'Innsláttur - Brýr'!X$6:X$132)","v":0},{"$f":"SUMIF('Innsláttur - Brýr'!$L$6:$L172,$B69,'Innsláttur - Brýr'!Y$6:Y$132)","v":0},{"$f":"SUMIF('Innsláttur - Brýr'!$L$6:$L172,$B69,'Innsláttur - Brýr'!Z$6:Z$132)","v":0},{"$f":"SUMIF('Innsláttur - Brýr'!$L$6:$L172,$B69,'Innsláttur - Brýr'!AA$6:AA$132)","v":0},{"$f":"SUMIF('Innsláttur - Brýr'!$L$6:$L172,$B69,'Innsláttur - Brýr'!AB$6:AB$132)","v":0}]
[null,"84.57 Vatnsvarnalag undir malbiki",{"$f":"SUMIF('Innsláttur - Brýr'!$L$6:$L173,$B70,'Innsláttur - Brýr'!W$6:W$132)","v":0},{"$f":"SUMIF('Innsláttur - Brýr'!$L$6:$L173,$B70,'Innsláttur - Brýr'!X$6:X$132)","v":0},{"$f":"SUMIF('Innsláttur - Brýr'!$L$6:$L173,$B70,'Innsláttur - Brýr'!Y$6:Y$132)","v":0},{"$f":"SUMIF('Innsláttur - Brýr'!$L$6:$L173,$B70,'Innsláttur - Brýr'!Z$6:Z$132)","v":0},{"$f":"SUMIF('Innsláttur - Brýr'!$L$6:$L173,$B70,'Innsláttur - Brýr'!AA$6:AA$132)","v":0},{"$f":"SUMIF('Innsláttur - Brýr'!$L$6:$L173,$B70,'Innsláttur - Brýr'!AB$6:AB$132)","v":0}]
[null,"85.1 Stálvirki",{"$f":"SUMIF('Innsláttur - Brýr'!$L$6:$L174,$B71,'Innsláttur - Brýr'!W$6:W$132)","v":0},{"$f":"SUMIF('Innsláttur - Brýr'!$L$6:$L174,$B71,'Innsláttur - Brýr'!X$6:X$132)","v":0},{"$f":"SUMIF('Innsláttur - Brýr'!$L$6:$L174,$B71,'Innsláttur - Brýr'!Y$6:Y$132)","v":0},{"$f":"SUMIF('Innsláttur - Brýr'!$L$6:$L174,$B71,'Innsláttur - Brýr'!Z$6:Z$132)","v":0},{"$f":"SUMIF('Innsláttur - Brýr'!$L$6:$L174,$B71,'Innsláttur - Brýr'!AA$6:AA$132)","v":0},{"$f":"SUMIF('Innsláttur - Brýr'!$L$6:$L174,$B71,'Innsláttur - Brýr'!AB$6:AB$132)","v":0}]
[null,"86.1 Legur",{"$f":"SUMIF('Innsláttur - Brýr'!$L$6:$L175,$B72,'Innsláttur - Brýr'!W$6:W$132)","v":0},{"$f":"SUMIF('Innsláttur - Brýr'!$L$6:$L175,$B72,'Innsláttur - Brýr'!X$6:X$132)","v":0},{"$f":"SUMIF('Innsláttur - Brýr'!$L$6:$L175,$B72,'Innsláttur - Brýr'!Y$6:Y$132)","v":0},{"$f":"SUMIF('Innsláttur - Brýr'!$L$6:$L175,$B72,'Innsláttur - Brýr'!Z$6:Z$132)","v":0},{"$f":"SUMIF('Innsláttur - Brýr'!$L$6:$L175,$B72,'Innsláttur - Brýr'!AA$6:AA$132)","v":0},{"$f":"SUMIF('Innsláttur - Brýr'!$L$6:$L175,$B72,'Innsláttur - Brýr'!AB$6:AB$132)","v":0}]
[null,"86.4 Þensluraufar",{"$f":"SUMIF('Innsláttur - Brýr'!$L$6:$L176,$B73,'Innsláttur - Brýr'!W$6:W$132)","v":0},{"$f":"SUMIF('Innsláttur - Brýr'!$L$6:$L176,$B73,'Innsláttur - Brýr'!X$6:X$132)","v":0},{"$f":"SUMIF('Innsláttur - Brýr'!$L$6:$L176,$B73,'Innsláttur - Brýr'!Y$6:Y$132)","v":0},{"$f":"SUMIF('Innsláttur - Brýr'!$L$6:$L176,$B73,'Innsláttur - Brýr'!Z$6:Z$132)","v":0},{"$f":"SUMIF('Innsláttur - Brýr'!$L$6:$L176,$B73,'Innsláttur - Brýr'!AA$6:AA$132)","v":0},{"$f":"SUMIF('Innsláttur - Brýr'!$L$6:$L176,$B73,'Innsláttur - Brýr'!AB$6:AB$132)","v":0}]
[null,"Samtals",{"$f":"SUM(C37:C73)","v":0},0,0,0,0,0]

{"sheet":"Niðurstöður - Jarðgöng","index":9,"n_rows":89,"n_cols":26,"rows_kept":89,"cut":false,"hidden":false,"merged":[[3,1,3,7],[5,2,5,7],[3,11,3,16],[4,11,4,16],[13,13,13,15],[2,21,2,23],[10,11,10,16],[11,11,11,16],[6,11,6,16],[7,11,7,16],[8,11,8,16],[5,11,5,16],[20,11,20,15],[28,21,28,25],[34,1,34,7],[36,2,36,7],[15,14,15,16],[16,14,16,16],[17,1,17,7],[15,11,15,12],[16,11,16,12],[19,2,19,7]]}
[]
[null,"Niðurstöður - Jarðgöng",null,null,null,null,null,null,null,null,"Skýrsla - Jarðgöng"]
[null,null,null,null,null,null,null,null,null,null,null,null,null,null,null,null,null,null,null,null,null,"kg CO2-ígildi"]
[null,"Niðurstöður kolefnisútreikninga, deilt niður á yfirverkþætti og vistferilsfasa",null,null,null,null,null,null,null,null,"Nafn verkefnis",{"$f":"IF(ISBLANK(Forsíða!D5),\"\",Forsíða!D5)","v":""},null,null,null,null,null,null,null,null,null,"Heild","Per km","per m2"]
[null,null,null,null,null,null,null,null,null,null,"Veghluti","Jarðgöng",null,null,null,null,null,null,null,null,"A1-A3",{"$f":"L30","v":0},{"$f":"V5/($L$14/1000)","v":{"$error":"#DIV/0!"}},{"$f":"V5/$Q$14","v":{"$error":"#DIV/0!"}}]
[null,null,"kg CO2-ígildi",null,null,null,null,null,null,null,"Staðsetning",{"$f":"IF(ISBLANK(Forsíða!D6),\"\",Forsíða!D6)","v":""},null,null,null,null,null,null,null,null,"A4",{"$f":"M30","v":0},{"$f":"V6/($L$14/1000)","v":{"$error":"#DIV/0!"}},{"$f":"V6/$Q$14","v":{"$error":"#DIV/0!"}}]
[null,null,"A1-A3","A4","A5","A1-A5","B4","A1-A5 + B4",null,null,"Dagsetning greiningar",{"$f":"IF(ISBLANK(Forsíða!D7),\"\",Forsíða!D7)","v":"dd.mm.yyyy"},null,null,null,null,null,null,null,null,"A5",{"$f":"N30","v":0},{"$error":"#DIV/0!"},{"$f":"V7/$Q$14","v":{"$error":"#DIV/0!"}}]
[null,"Skeringar og undirbygging",{"$f":"SUMIF('Innsláttur - Jarðgöng'!$K$6:$K$170,$B8,'Innsláttur - Jarðgöng'!W$6:W$170)","v":0},{"$f":"SUMIF('Innsláttur - Jarðgöng'!$K$6:$K$170,$B8,'Innsláttur - Jarðgöng'!X$6:X$170)","v":0},{"$f":"SUMIF('Innsláttur - Jarðgöng'!$K$6:$K$170,$B8,'Innsláttur - Jarðgöng'!Y$6:Y$170)","v":0},{"$f":"SUMIF('Innsláttur - Jarðgöng'!$K$6:$K$170,$B8,'Innsláttur - Jarðgöng'!Z$6:Z$170)","v":0},{"$f":"SUMIF('Innsláttur - Jarðgöng'!$K$6:$K$170,$B8,'Innsláttur - Jarðgöng'!AA$6:AA$170)","v":0},{"$f":"SUMIF('Innsláttur - Jarðgöng'!$K$6:$K$170,$B8,'Innsláttur - Jarðgöng'!AB$6:AB$170)","v":0},null,null,"Greiningartími (ár)",{"$f":"IF(ISBLANK(Forsíða!D8),\"\",Forsíða!D8)","v":60},null,null,null,null,null,null,null,null,"B4",{"$f":"O30","v":0},{"$error":"#DIV/0!"},{"$f":"V8/$Q$14","v":{"$error":"#DIV/0!"}}]
[null,"Ræsi og veitur",{"$f":"SUMIF('Innsláttur - Jarðgöng'!$K$6:$K$170,$B9,'Innsláttur - Jarðgöng'!W$6:W$170)","v":0},{"$f":"SUMIF('Innsláttur - Jarðgöng'!$K$6:$K$170,$B9,'Innsláttur - Jarðgöng'!X$6:X$170)","v":0},{"$f":"SUMIF('Innsláttur - Jarðgöng'!$K$6:$K$170,$B9,'Innsláttur - Jarðgöng'!Y$6:Y$170)","v":0},{"$f":"SUMIF('Innsláttur - Jarðgöng'!$K$6:$K$170,$B9,'Innsláttur - Jarðgöng'!Z$6:Z$170)","v":0},{"$f":"SUMIF('Innsláttur - Jarðgöng'!$K$6:$K$170,$B9,'Innsláttur - Jarðgöng'!AA$6:AA$170)","v":0},{"$f":"SUMIF('Innsláttur - Jarðgöng'!$K$6:$K$170,$B9,'Innsláttur - Jarðgöng'!AB$6:AB$170)","v":0},null,null,"Unnið af",{"$f":"IF(ISBLANK(Forsíða!D9),\"\",Forsíða!D9)","v":""},null,null,null,null,null,null,null,null,"Samtals",{"$f":"SUM(V5:V8)","v":0},{"$f":"SUM(W5:W8)","v":{"$error":"#DIV/0!"}},{"$error":"#DIV/0!"}]
[null,"Styrktar- og burðarlög",{"$f":"SUMIF('Innsláttur - Jarðgöng'!$K$6:$K$170,$B10,'Innsláttur - Jarðgöng'!W$6:W$170)","v":0},{"$f":"SUMIF('Innsláttur - Jarðgöng'!$K$6:$K$170,$B10,'Innsláttur - Jarðgöng'!X$6:X$170)","v":0},{"$f":"SUMIF('Innsláttur - Jarðgöng'!$K$6:$K$170,$B10,'Innsláttur - Jarðgöng'!Y$6:Y$170)","v":0},{"$f":"SUMIF('Innsláttur - Jarðgöng'!$K$6:$K$170,$B10,'Innsláttur - Jarðgöng'!Z$6:Z$170)","v":0},{"$f":"SUMIF('Innsláttur - Jarðgöng'!$K$6:$K$170,$B10,'Innsláttur - Jarðgöng'!AA$6:AA$170)","v":0},{"$f":"SUMIF('Innsláttur - Jarðgöng'!$K$6:$K$170,$B10,'Innsláttur - Jarðgöng'!AB$6:AB$170)","v":0}]
[null,"Slitlög",{"$f":"SUMIF('Innsláttur - Jarðgöng'!$K$6:$K$170,$B11,'Innsláttur - Jarðgöng'!W$6:W$170)","v":0},{"$f":"SUMIF('Innsláttur - Jarðgöng'!$K$6:$K$170,$B11,'Innsláttur - Jarðgöng'!X$6:X$170)","v":0},{"$f":"SUMIF('Innsláttur - Jarðgöng'!$K$6:$K$170,$B11,'Innsláttur - Jarðgöng'!Y$6:Y$170)","v":0},{"$f":"SUMIF('Innsláttur - Jarðgöng'!$K$6:$K$170,$B11,'Innsláttur - Jarðgöng'!Z$6:Z$170)","v":0},{"$f":"SUMIF('Innsláttur - Jarðgöng'!$K$6:$K$170,$B11,'Innsláttur - Jarðgöng'!AA$6:AA$170)","v":0},{"$f":"SUMIF('Innsláttur - Jarðgöng'!$K$6:$K$170,$B11,'Innsláttur - Jarðgöng'!AB$6:AB$170)","v":0},null,null,"Árdagsumferð (ÁDU)",{"$f":"IF(ISBLANK(Forsíða!D11),\"\",Forsíða!D11)","v":""}]
[null,"Öryggisbúnaður og frágangur",{"$f":"SUMIF('Innsláttur - Jarðgöng'!$K$6:$K$170,$B12,'Innsláttur - Jarðgöng'!W$6:W$170)","v":0},{"$f":"SUMIF('Innsláttur - Jarðgöng'!$K$6:$K$170,$B12,'Innsláttur - Jarðgöng'!X$6:X$170)","v":0},{"$f":"SUMIF('Innsláttur - Jarðgöng'!$K$6:$K$170,$B12,'Innsláttur - Jarðgöng'!Y$6:Y$170)","v":0},{"$f":"SUMIF('Innsláttur - Jarðgöng'!$K$6:$K$170,$B12,'Innsláttur - Jarðgöng'!Z$6:Z$170)","v":0},{"$f":"SUMIF('Innsláttur - Jarðgöng'!$K$6:$K$170,$B12,'Innsláttur - Jarðgöng'!AA$6:AA$170)","v":0},{"$f":"SUMIF('Innsláttur - Jarðgöng'!$K$6:$K$170,$B12,'Innsláttur - Jarðgöng'!AB$6:AB$170)","v":0},null,null,"Framkvæmdarstig",{"$f":"IF(ISBLANK(Forsíða!D12),\"\",Forsíða!D12)","v":"Veldu framkvæmdarstig"}]
[null,"Brýr og steypt mannvirki",{"$f":"SUMIF('Innsláttur - Jarðgöng'!$K$6:$K$170,$B13,'Innsláttur - Jarðgöng'!W$6:W$170)","v":0},{"$f":"SUMIF('Innsláttur - Jarðgöng'!$K$6:$K$170,$B13,'Innsláttur - Jarðgöng'!X$6:X$170)","v":0},{"$f":"SUMIF('Innsláttur - Jarðgöng'!$K$6:$K$170,$B13,'Innsláttur - Jarðgöng'!Y$6:Y$170)","v":0},{"$f":"SUMIF('Innsláttur - Jarðgöng'!$K$6:$K$170,$B13,'Innsláttur - Jarðgöng'!Z$6:Z$170)","v":0},{"$f":"SUMIF('Innsláttur - Jarðgöng'!$K$6:$K$170,$B13,'Innsláttur - Jarðgöng'!AA$6:AA$170)","v":0},{"$f":"SUMIF('Innsláttur - Jarðgöng'!$K$6:$K$170,$B13,'Innsláttur - Jarðgöng'!AB$6:AB$170)","v":0}]
[null,"Jarðgöng",{"$f":"SUMIF('Innsláttur - Jarðgöng'!$K$6:$K$170,$B14,'Innsláttur - Jarðgöng'!W$6:W$170)","v":0},{"$f":"SUMIF('Innsláttur - Jarðgöng'!$K$6:$K$170,$B14,'Innsláttur - Jarðgöng'!X$6:X$170)","v":0},{"$f":"SUMIF('Innsláttur - Jarðgöng'!$K$6:$K$170,$B14,'Innsláttur - Jarðgöng'!Y$6:Y$170)","v":0},{"$f":"SUMIF('Innsláttur - Jarðgöng'!$K$6:$K$170,$B14,'Innsláttur - Jarðgöng'!Z$6:Z$170)","v":0},{"$f":"SUMIF('Innsláttur - Jarðgöng'!$K$6:$K$170,$B14,'Innsláttur - Jarðgöng'!AA$6:AA$170)","v":0},{"$f":"SUMIF('Innsláttur - Jarðgöng'!$K$6:$K$170,$B14,'Innsláttur - Jarðgöng'!AB$6:AB$170)","v":0},null,null,"Heildarlengd jarðgangna [m]",{"$f":"Forsíða!D16","v":0},null,"Heildarflatarmál jarðgangna [m2]",null,null,{"$f":"Forsíða!G16","v":0}]
[null,"Samtals",{"$f":"SUM(C8:C14)","v":0},0,0,0,0,0]
[null,null,null,null,null,null,null,null,null,null,"Útreiknað heildarkolefnisspor",{"$f":"MROUND(V9/1000,10)&\" tonn CO2-ígildi\"","v":"0 tonn CO2-ígildi"},null,"Óvissubil",{"$f":"IF(L12=Sheet2!P7,\"Engin áætluð óvissa\",MROUND(V9*_xlfn.XLOOKUP(L12,Sheet2!P3:P7,Sheet2!Q3:Q7)/1000,10)&\" - \"&MROUND(V9*_xlfn.XLOOKUP(L12,Sheet2!P3:P7,Sheet2!R3:R7)/1000,10)&\" tonn CO2-ígildi\")","v":{"$error":"#N/A"}}]
[null,null,null,null,null,null,null,null,null,null,"Útreiknað kolefnisspor á m2",{"$f":"MROUND(X9,1)&\" kg CO2-ígildi/m2\"","v":{"$error":"#DIV/0!"}},null,"Óvissubil",{"$f":"IF(L12=Sheet2!P7,\"Engin áætluð óvissa\",MROUND(V9*_xlfn.XLOOKUP(L12,Sheet2!P3:P7,Sheet2!Q3:Q7)/Q14,1)&\" - \"&MROUND(V9*_xlfn.XLOOKUP(L12,Sheet2!P3:P7,Sheet2!R3:R7)/Q14,1)&\" kg CO2-ígildi/m2\")","v":{"$error":"#N/A"}}]
[null,"Niðurstöður kolefnisútreikninga, skipt niður á efnisflokka og vistferilsfasa"]
[]
[null,null,"kg CO2-ígildi"]
[null,null,"A1-A3","A4","A5","A1-A5","B4","A1-A5 + B4",null,null,null,"kg CO2-ígildi"]
[null,"Jarðvinna",{"$f":"SUMIF('Innsláttur - Jarðgöng'!$I$6:$I170,$B22,'Innsláttur - Jarðgöng'!W$6:W$130)","v":0},{"$f":"SUMIF('Innsláttur - Jarðgöng'!$I$6:$I170,$B22,'Innsláttur - Jarðgöng'!X$6:X$170)","v":0},{"$f":"SUMIF('Innsláttur - Jarðgöng'!$I$6:$I170,$B22,'Innsláttur - Jarðgöng'!Y$6:Y$170)-SUMIF('Innsláttur - Jarðgöng'!$I$6:$I170,$B22,'Innsláttur - Jarðgöng'!S$6:S$170)*EF_oil","v":0},{"$f":"SUM(C22:E22)","v":0},{"$f":"SUMIF('Innsláttur - Jarðgöng'!$I$6:$I170,$B22,'Innsláttur - Jarðgöng'!AA$6:AA$170)","v":0},{"$f":"SUMIF('Innsláttur - Jarðgöng'!$I$6:$I170,$B22,'Innsláttur - Jarðgöng'!AB$6:AB$170)","v":0},null,null,null,"A1-A3","A4","A5","B4","Samtals"]
[null,"Plast",{"$f":"SUMIF('Innsláttur - Jarðgöng'!$I$6:$I171,$B23,'Innsláttur - Jarðgöng'!W$6:W$130)","v":0},{"$f":"SUMIF('Innsláttur - Jarðgöng'!$I$6:$I171,$B23,'Innsláttur - Jarðgöng'!X$6:X$170)","v":0},{"$f":"SUMIF('Innsláttur - Jarðgöng'!$I$6:$I171,$B23,'Innsláttur - Jarðgöng'!Y$6:Y$170)-SUMIF('Innsláttur - Jarðgöng'!$I$6:$I171,$B23,'Innsláttur - Jarðgöng'!S$6:S$170)*EF_oil","v":0},{"$f":"SUM(C23:E23)","v":0},{"$f":"SUMIF('Innsláttur - Jarðgöng'!$I$6:$I171,$B23,'Innsláttur - Jarðgöng'!AA$6:AA$170)","v":0},{"$f":"SUMIF('Innsláttur - Jarðgöng'!$I$6:$I171,$B23,'Innsláttur - Jarðgöng'!AB$6:AB$170)","v":0},null,null,"Skeringar og undirbygging",{"$f":"C8","v":0},0,0,{"$f":"G8","v":0},{"$f":"SUM(L23:O23)","v":0}]
[null,"Stál",{"$f":"SUMIF('Innsláttur - Jarðgöng'!$I$6:$I172,$B24,'Innsláttur - Jarðgöng'!W$6:W$130)","v":0},{"$f":"SUMIF('Innsláttur - Jarðgöng'!$I$6:$I172,$B24,'Innsláttur - Jarðgöng'!X$6:X$170)","v":0},{"$f":"SUMIF('Innsláttur - Jarðgöng'!$I$6:$I172,$B24,'Innsláttur - Jarðgöng'!Y$6:Y$170)-SUMIF('Innsláttur - Jarðgöng'!$I$6:$I172,$B24,'Innsláttur - Jarðgöng'!S$6:S$170)*EF_oil","v":0},0,{"$f":"SUMIF('Innsláttur - Jarðgöng'!$I$6:$I172,$B24,'Innsláttur - Jarðgöng'!AA$6:AA$170)","v":0},{"$f":"SUMIF('Innsláttur - Jarðgöng'!$I$6:$I172,$B24,'Innsláttur - Jarðgöng'!AB$6:AB$170)","v":0},null,null,"Ræsi og veitur",0,0,0,0,{"$f":"SUM(L24:O24)","v":0}]
[null,"Steypa",{"$f":"SUMIF('Innsláttur - Jarðgöng'!$I$6:$I173,$B25,'Innsláttur - Jarðgöng'!W$6:W$130)","v":0},{"$f":"SUMIF('Innsláttur - Jarðgöng'!$I$6:$I173,$B25,'Innsláttur - Jarðgöng'!X$6:X$170)","v":0},{"$f":"SUMIF('Innsláttur - Jarðgöng'!$I$6:$I173,$B25,'Innsláttur - Jarðgöng'!Y$6:Y$170)-SUMIF('Innsláttur - Jarðgöng'!$I$6:$I173,$B25,'Innsláttur - Jarðgöng'!S$6:S$170)*EF_oil","v":0},0,{"$f":"SUMIF('Innsláttur - Jarðgöng'!$I$6:$I173,$B25,'Innsláttur - Jarðgöng'!AA$6:AA$170)","v":0},{"$f":"SUMIF('Innsláttur - Jarðgöng'!$I$6:$I173,$B25,'Innsláttur - Jarðgöng'!AB$6:AB$170)","v":0},null,null,"Styrktar- og burðarlög",0,0,0,0,0]
[null,"Rafstrengur",{"$f":"SUMIF('Innsláttur - Jarðgöng'!$I$6:$I174,$B26,'Innsláttur - Jarðgöng'!W$6:W$130)","v":0},{"$f":"SUMIF('Innsláttur - Jarðgöng'!$I$6:$I174,$B26,'Innsláttur - Jarðgöng'!X$6:X$170)","v":0},{"$f":"SUMIF('Innsláttur - Jarðgöng'!$I$6:$I174,$B26,'Innsláttur - Jarðgöng'!Y$6:Y$170)-SUMIF('Innsláttur - Jarðgöng'!$I$6:$I174,$B26,'Innsláttur - Jarðgöng'!S$6:S$170)*EF_oil","v":0},0,{"$f":"SUMIF('Innsláttur - Jarðgöng'!$I$6:$I174,$B26,'Innsláttur - Jarðgöng'!AA$6:AA$170)","v":0},{"$f":"SUMIF('Innsláttur - Jarðgöng'!$I$6:$I174,$B26,'Innsláttur - Jarðgöng'!AB$6:AB$170)","v":0},null,null,"Slitlög",0,0,0,0,0]
[null,"Malbik",{"$f":"SUMIF('Innsláttur - Jarðgöng'!$I$6:$I176,$B27,'Innsláttur - Jarðgöng'!W$6:W$130)","v":0},{"$f":"SUMIF('Innsláttur - Jarðgöng'!$I$6:$I176,$B27,'Innsláttur - Jarðgöng'!X$6:X$170)","v":0},{"$f":"SUMIF('Innsláttur - Jarðgöng'!$I$6:$I176,$B27,'Innsláttur - Jarðgöng'!Y$6:Y$170)-SUMIF('Innsláttur - Jarðgöng'!$I$6:$I176,$B27,'Innsláttur - Jarðgöng'!S$6:S$170)*EF_oil","v":0},0,{"$f":"SUMIF('Innsláttur - Jarðgöng'!$I$6:$I176,$B27,'Innsláttur - Jarðgöng'!AA$6:AA$170)","v":0},{"$f":"SUMIF('Innsláttur - Jarðgöng'!$I$6:$I176,$B27,'Innsláttur - Jarðgöng'!AB$6:AB$170)","v":0},null,null,"Öryggisbúnaður og frágangur",0,0,0,0,0]
[null,"Timbur",{"$f":"SUMIF('Innsláttur - Jarðgöng'!$I$6:$I177,$B28,'Innsláttur - Jarðgöng'!W$6:W$130)","v":0},{"$f":"SUMIF('Innsláttur - Jarðgöng'!$I$6:$I177,$B28,'Innsláttur - Jarðgöng'!X$6:X$170)","v":0},{"$f":"SUMIF('Innsláttur - Jarðgöng'!$I$6:$I177,$B28,'Innsláttur - Jarðgöng'!Y$6:Y$170)-SUMIF('Innsláttur - Jarðgöng'!$I$6:$I177,$B28,'Innsláttur - Jarðgöng'!S$6:S$170)*EF_oil","v":0},0,{"$f":"SUMIF('Innsláttur - Jarðgöng'!$I$6:$I177,$B28,'Innsláttur - Jarðgöng'!AA$6:AA$170)","v":0},{"$f":"SUMIF('Innsláttur - Jarðgöng'!$I$6:$I177,$B28,'Innsláttur - Jarðgöng'!AB$6:AB$170)","v":0},null,null,"Brýr og steypt mannvirki",0,0,0,0,0]
[null,"Annað",{"$f":"SUMIF('Innsláttur - Jarðgöng'!$I$6:$I178,$B29,'Innsláttur - Jarðgöng'!W$6:W$130)","v":0},{"$f":"SUMIF('Innsláttur - Jarðgöng'!$I$6:$I178,$B29,'Innsláttur - Jarðgöng'!X$6:X$170)","v":0},{"$f":"SUMIF('Innsláttur - Jarðgöng'!$I$6:$I178,$B29,'Innsláttur - Jarðgöng'!Y$6:Y$170)-SUMIF('Innsláttur - Jarðgöng'!$I$6:$I178,$B29,'Innsláttur - Jarðgöng'!S$6:S$170)*EF_oil","v":0},0,{"$f":"SUMIF('Innsláttur - Jarðgöng'!$I$6:$I178,$B29,'Innsláttur - Jarðgöng'!AA$6:AA$170)","v":0},{"$f":"SUMIF('Innsláttur - Jarðgöng'!$I$6:$I178,$B29,'Innsláttur - Jarðgöng'!AB$6:AB$170)","v":0},null,null,"Jarðgöng",0,0,0,0,0,null,null,null,null,null,"kg CO2-ígildi"]
[null,"Gúmmí",{"$f":"SUMIF('Innsláttur - Jarðgöng'!$I$6:$I179,$B30,'Innsláttur - Jarðgöng'!W$6:W$130)","v":0},{"$f":"SUMIF('Innsláttur - Jarðgöng'!$I$6:$I179,$B30,'Innsláttur - Jarðgöng'!X$6:X$170)","v":0},{"$f":"SUMIF('Innsláttur - Jarðgöng'!$I$6:$I179,$B30,'Innsláttur - Jarðgöng'!Y$6:Y$170)-SUMIF('Innsláttur - Jarðgöng'!$I$6:$I179,$B30,'Innsláttur - Jarðgöng'!S$6:S$170)*EF_oil","v":0},0,{"$f":"SUMIF('Innsláttur - Jarðgöng'!$I$6:$I179,$B30,'Innsláttur - Jarðgöng'!AA$6:AA$170)","v":0},{"$f":"SUMIF('Innsláttur - Jarðgöng'!$I$6:$I179,$B30,'Innsláttur - Jarðgöng'!AB$6:AB$170)","v":0},null,null,"Samtals",{"$f":"SUM(L23:L29)","v":0},{"$f":"SUM(M23:M29)","v":0},0,0,0,null,null,null,null,null,"A1-A3","A4","A5","B4","Samtals"]
[null,"Dísilolíunotkun á verkstað",{"$f":"SUMIF('Innsláttur - Jarðgöng'!$I$6:$I180,$B31,'Innsláttur - Jarðgöng'!W$6:W$130)","v":0},{"$f":"SUMIF('Innsláttur - Jarðgöng'!$I$6:$I180,$B31,'Innsláttur - Jarðgöng'!X$6:X$170)","v":0},{"$f":"'Innsláttur - Jarðgöng'!S172*EF_oil","v":0},0,{"$f":"SUMIF('Innsláttur - Jarðgöng'!$I$6:$I180,$B31,'Innsláttur - Jarðgöng'!AA$6:AA$170)","v":0},{"$f":"SUMIF('Innsláttur - Jarðgöng'!$I$6:$I180,$B31,'Innsláttur - Jarðgöng'!AB$6:AB$170)","v":0},null,null,null,null,null,null,null,null,null,null,null,null,"Jarðvinna",{"$f":"C22","v":0},{"$f":"D22","v":0},{"$f":"E22","v":0},{"$f":"G22","v":0},{"$f":"SUM(V31:Y31)","v":0}]
[null,"Samtals",{"$f":"SUM(C22:C31)","v":0},0,0,0,0,0,null,null,null,null,null,null,null,null,null,null,null,null,"Plast",0,0,0,0,0]
[null,null,null,null,null,null,null,null,null,null,null,null,null,null,null,null,null,null,null,null,"Stál",0,0,0,0,0]
[null,null,null,null,null,null,null,null,null,null,null,null,null,null,null,null,null,null,null,null,"Steypa",0,0,0,0,0]
[null,"Niðurstöður kolefnisútreikninga, deilt niður á undirverkþætti og vistferilsfasa",null,null,null,null,null,null,null,null,null,null,null,null,null,null,null,null,null,null,"Rafstrengur",0,0,0,0,0]
[null,null,null,null,null,null,null,null,null,null,null,null,null,null,null,null,null,null,null,null,"Malbik",0,0,0,0,0]
[null,null,"kg CO2-ígildi",null,null,null,null,null,null,null,null,null,null,null,null,null,null,null,null,null,"Timbur",0,0,0,0,0]
[null,null,"A1-A3","A4","A5","A1-A5","B4","A1-A5 + B4",null,null,null,null,null,null,null,null,null,null,null,null,"Annað",0,0,0,0,0]
[null,"32.1 Bergskeringar í vegstæði",{"$f":"SUMIF('Innsláttur - Jarðgöng'!$L$6:$L170,$B39,'Innsláttur - Jarðgöng'!W$6:W$170)","v":0},{"$f":"SUMIF('Innsláttur - Jarðgöng'!$L$6:$L170,$B39,'Innsláttur - Jarðgöng'!X$6:X$170)","v":0},{"$f":"SUMIF('Innsláttur - Jarðgöng'!$L$6:$L170,$B39,'Innsláttur - Jarðgöng'!Y$6:Y$170)","v":0},{"$f":"SUMIF('Innsláttur - Jarðgöng'!$L$6:$L170,$B39,'Innsláttur - Jarðgöng'!Z$6:Z$170)","v":0},{"$f":"SUMIF('Innsláttur - Jarðgöng'!$L$6:$L170,$B39,'Innsláttur - Jarðgöng'!AA$6:AA$170)","v":0},{"$f":"SUMIF('Innsláttur - Jarðgöng'!$L$6:$L170,$B39,'Innsláttur - Jarðgöng'!AB$6:AB$170)","v":0},null,null,null,null,null,null,null,null,null,null,null,null,"Gúmmí",0,0,0,0,0]
[null,"32.2 Bergskeringar í námu",{"$f":"SUMIF('Innsláttur - Jarðgöng'!$L$6:$L171,$B40,'Innsláttur - Jarðgöng'!W$6:W$170)","v":0},{"$f":"SUMIF('Innsláttur - Jarðgöng'!$L$6:$L171,$B40,'Innsláttur - Jarðgöng'!X$6:X$170)","v":0},{"$f":"SUMIF('Innsláttur - Jarðgöng'!$L$6:$L171,$B40,'Innsláttur - Jarðgöng'!Y$6:Y$170)","v":0},{"$f":"SUMIF('Innsláttur - Jarðgöng'!$L$6:$L171,$B40,'Innsláttur - Jarðgöng'!Z$6:Z$170)","v":0},{"$f":"SUMIF('Innsláttur - Jarðgöng'!$L$6:$L171,$B40,'Innsláttur - Jarðgöng'!AA$6:AA$170)","v":0},{"$f":"SUMIF('Innsláttur - Jarðgöng'!$L$6:$L171,$B40,'Innsláttur - Jarðgöng'!AB$6:AB$170)","v":0},null,null,null,null,null,null,null,null,null,null,null,null,"Dísilolíunotkun á verkstað",0,0,0,0,0]
[null,"33.1 Fyllingarefni úr skeringum",{"$f":"SUMIF('Innsláttur - Jarðgöng'!$L$6:$L172,$B41,'Innsláttur - Jarðgöng'!W$6:W$170)","v":0},{"$f":"SUMIF('Innsláttur - Jarðgöng'!$L$6:$L172,$B41,'Innsláttur - Jarðgöng'!X$6:X$170)","v":0},{"$f":"SUMIF('Innsláttur - Jarðgöng'!$L$6:$L172,$B41,'Innsláttur - Jarðgöng'!Y$6:Y$170)","v":0},{"$f":"SUMIF('Innsláttur - Jarðgöng'!$L$6:$L172,$B41,'Innsláttur - Jarðgöng'!Z$6:Z$170)","v":0},{"$f":"SUMIF('Innsláttur - Jarðgöng'!$L$6:$L172,$B41,'Innsláttur - Jarðgöng'!AA$6:AA$170)","v":0},{"$f":"SUMIF('Innsláttur - Jarðgöng'!$L$6:$L172,$B41,'Innsláttur - Jarðgöng'!AB$6:AB$170)","v":0},null,null,null,null,null,null,null,null,null,null,null,null,"Samtals",{"$f":"SUM(V31:V40)","v":0},{"$f":"SUM(W31:W40)","v":0},{"$f":"SUM(X31:X40)","v":0},{"$f":"SUM(Y31:Y40)","v":0},{"$f":"SUM(V41:Y41)","v":0}]
[null,"33.2 Fyllingarefni úr námu",{"$f":"SUMIF('Innsláttur - Jarðgöng'!$L$6:$L173,$B42,'Innsláttur - Jarðgöng'!W$6:W$170)","v":0},{"$f":"SUMIF('Innsláttur - Jarðgöng'!$L$6:$L173,$B42,'Innsláttur - Jarðgöng'!X$6:X$170)","v":0},{"$f":"SUMIF('Innsláttur - Jarðgöng'!$L$6:$L173,$B42,'Innsláttur - Jarðgöng'!Y$6:Y$170)","v":0},{"$f":"SUMIF('Innsláttur - Jarðgöng'!$L$6:$L173,$B42,'Innsláttur - Jarðgöng'!Z$6:Z$170)","v":0},{"$f":"SUMIF('Innsláttur - Jarðgöng'!$L$6:$L173,$B42,'Innsláttur - Jarðgöng'!AA$6:AA$170)","v":0},{"$f":"SUMIF('Innsláttur - Jarðgöng'!$L$6:$L173,$B42,'Innsláttur - Jarðgöng'!AB$6:AB$170)","v":0}]
[null,"34.1 Fláafleygar, efni úr skeringum",{"$f":"SUMIF('Innsláttur - Jarðgöng'!$L$6:$L174,$B43,'Innsláttur - Jarðgöng'!W$6:W$170)","v":0},{"$f":"SUMIF('Innsláttur - Jarðgöng'!$L$6:$L174,$B43,'Innsláttur - Jarðgöng'!X$6:X$170)","v":0},{"$f":"SUMIF('Innsláttur - Jarðgöng'!$L$6:$L174,$B43,'Innsláttur - Jarðgöng'!Y$6:Y$170)","v":0},{"$f":"SUMIF('Innsláttur - Jarðgöng'!$L$6:$L174,$B43,'Innsláttur - Jarðgöng'!Z$6:Z$170)","v":0},{"$f":"SUMIF('Innsláttur - Jarðgöng'!$L$6:$L174,$B43,'Innsláttur - Jarðgöng'!AA$6:AA$170)","v":0},{"$f":"SUMIF('Innsláttur - Jarðgöng'!$L$6:$L174,$B43,'Innsláttur - Jarðgöng'!AB$6:AB$170)","v":0}]
[null,"34.8 Ónothæfu efni jafnað á losunarstað",{"$f":"SUMIF('Innsláttur - Jarðgöng'!$L$6:$L175,$B44,'Innsláttur - Jarðgöng'!W$6:W$170)","v":0},{"$f":"SUMIF('Innsláttur - Jarðgöng'!$L$6:$L175,$B44,'Innsláttur - Jarðgöng'!X$6:X$170)","v":0},{"$f":"SUMIF('Innsláttur - Jarðgöng'!$L$6:$L175,$B44,'Innsláttur - Jarðgöng'!Y$6:Y$170)","v":0},{"$f":"SUMIF('Innsláttur - Jarðgöng'!$L$6:$L175,$B44,'Innsláttur - Jarðgöng'!Z$6:Z$170)","v":0},{"$f":"SUMIF('Innsláttur - Jarðgöng'!$L$6:$L175,$B44,'Innsláttur - Jarðgöng'!AA$6:AA$170)","v":0},{"$f":"SUMIF('Innsláttur - Jarðgöng'!$L$6:$L175,$B44,'Innsláttur - Jarðgöng'!AB$6:AB$170)","v":0}]
[null,"36.2 Grjótvörn",{"$f":"SUMIF('Innsláttur - Jarðgöng'!$L$6:$L176,$B45,'Innsláttur - Jarðgöng'!W$6:W$170)","v":0},{"$f":"SUMIF('Innsláttur - Jarðgöng'!$L$6:$L176,$B45,'Innsláttur - Jarðgöng'!X$6:X$170)","v":0},{"$f":"SUMIF('Innsláttur - Jarðgöng'!$L$6:$L176,$B45,'Innsláttur - Jarðgöng'!Y$6:Y$170)","v":0},{"$f":"SUMIF('Innsláttur - Jarðgöng'!$L$6:$L176,$B45,'Innsláttur - Jarðgöng'!Z$6:Z$170)","v":0},{"$f":"SUMIF('Innsláttur - Jarðgöng'!$L$6:$L176,$B45,'Innsláttur - Jarðgöng'!AA$6:AA$170)","v":0},{"$f":"SUMIF('Innsláttur - Jarðgöng'!$L$6:$L176,$B45,'Innsláttur - Jarðgöng'!AB$6:AB$170)","v":0}]
[null,"45.71 Plaströr, vatnsveita",{"$f":"SUMIF('Innsláttur - Jarðgöng'!$L$6:$L179,$B46,'Innsláttur - Jarðgöng'!W$6:W$170)","v":0},{"$f":"SUMIF('Innsláttur - Jarðgöng'!$L$6:$L179,$B46,'Innsláttur - Jarðgöng'!X$6:X$170)","v":0},{"$f":"SUMIF('Innsláttur - Jarðgöng'!$L$6:$L179,$B46,'Innsláttur - Jarðgöng'!Y$6:Y$170)","v":0},{"$f":"SUMIF('Innsláttur - Jarðgöng'!$L$6:$L179,$B46,'Innsláttur - Jarðgöng'!Z$6:Z$170)","v":0},{"$f":"SUMIF('Innsláttur - Jarðgöng'!$L$6:$L179,$B46,'Innsláttur - Jarðgöng'!AA$6:AA$170)","v":0},{"$f":"SUMIF('Innsláttur - Jarðgöng'!$L$6:$L179,$B46,'Innsláttur - Jarðgöng'!AB$6:AB$170)","v":0}]
[null,"42.3 Plaströr, fráveita",{"$f":"SUMIF('Innsláttur - Jarðgöng'!$L$6:$L180,$B47,'Innsláttur - Jarðgöng'!W$6:W$170)","v":0},{"$f":"SUMIF('Innsláttur - Jarðgöng'!$L$6:$L180,$B47,'Innsláttur - Jarðgöng'!X$6:X$170)","v":0},{"$f":"SUMIF('Innsláttur - Jarðgöng'!$L$6:$L180,$B47,'Innsláttur - Jarðgöng'!Y$6:Y$170)","v":0},{"$f":"SUMIF('Innsláttur - Jarðgöng'!$L$6:$L180,$B47,'Innsláttur - Jarðgöng'!Z$6:Z$170)","v":0},{"$f":"SUMIF('Innsláttur - Jarðgöng'!$L$6:$L180,$B47,'Innsláttur - Jarðgöng'!AA$6:AA$170)","v":0},{"$f":"SUMIF('Innsláttur - Jarðgöng'!$L$6:$L180,$B47,'Innsláttur - Jarðgöng'!AB$6:AB$170)","v":0}]
[null,"45.72 Hitaveiturör",{"$f":"SUMIF('Innsláttur - Jarðgöng'!$L$6:$L181,$B48,'Innsláttur - Jarðgöng'!W$6:W$170)","v":0},{"$f":"SUMIF('Innsláttur - Jarðgöng'!$L$6:$L181,$B48,'Innsláttur - Jarðgöng'!X$6:X$170)","v":0},{"$f":"SUMIF('Innsláttur - Jarðgöng'!$L$6:$L181,$B48,'Innsláttur - Jarðgöng'!Y$6:Y$170)","v":0},{"$f":"SUMIF('Innsláttur - Jarðgöng'!$L$6:$L181,$B48,'Innsláttur - Jarðgöng'!Z$6:Z$170)","v":0},{"$f":"SUMIF('Innsláttur - Jarðgöng'!$L$6:$L181,$B48,'Innsláttur - Jarðgöng'!AA$6:AA$170)","v":0},{"$f":"SUMIF('Innsláttur - Jarðgöng'!$L$6:$L181,$B48,'Innsláttur - Jarðgöng'!AB$6:AB$170)","v":0}]
[null,"42.4 Stálrör í ræsi",{"$f":"SUMIF('Innsláttur - Jarðgöng'!$L$6:$L182,$B49,'Innsláttur - Jarðgöng'!W$6:W$170)","v":0},{"$f":"SUMIF('Innsláttur - Jarðgöng'!$L$6:$L182,$B49,'Innsláttur - Jarðgöng'!X$6:X$170)","v":0},{"$f":"SUMIF('Innsláttur - Jarðgöng'!$L$6:$L182,$B49,'Innsláttur - Jarðgöng'!Y$6:Y$170)","v":0},{"$f":"SUMIF('Innsláttur - Jarðgöng'!$L$6:$L182,$B49,'Innsláttur - Jarðgöng'!Z$6:Z$170)","v":0},{"$f":"SUMIF('Innsláttur - Jarðgöng'!$L$6:$L182,$B49,'Innsláttur - Jarðgöng'!AA$6:AA$170)","v":0},{"$f":"SUMIF('Innsláttur - Jarðgöng'!$L$6:$L182,$B49,'Innsláttur - Jarðgöng'!AB$6:AB$170)","v":0}]
[null,"45.4 Steypt ofanvatnsræsi",{"$f":"SUMIF('Innsláttur - Jarðgöng'!$L$6:$L183,$B50,'Innsláttur - Jarðgöng'!W$6:W$170)","v":0},{"$f":"SUMIF('Innsláttur - Jarðgöng'!$L$6:$L183,$B50,'Innsláttur - Jarðgöng'!X$6:X$170)","v":0},{"$f":"SUMIF('Innsláttur - Jarðgöng'!$L$6:$L183,$B50,'Innsláttur - Jarðgöng'!Y$6:Y$170)","v":0},{"$f":"SUMIF('Innsláttur - Jarðgöng'!$L$6:$L183,$B50,'Innsláttur - Jarðgöng'!Z$6:Z$170)","v":0},{"$f":"SUMIF('Innsláttur - Jarðgöng'!$L$6:$L183,$B50,'Innsláttur - Jarðgöng'!AA$6:AA$170)","v":0},{"$f":"SUMIF('Innsláttur - Jarðgöng'!$L$6:$L183,$B50,'Innsláttur - Jarðgöng'!AB$6:AB$170)","v":0}]
[null,"45.5 Brunnar",{"$f":"SUMIF('Innsláttur - Jarðgöng'!$L$6:$L184,$B51,'Innsláttur - Jarðgöng'!W$6:W$170)","v":0},{"$f":"SUMIF('Innsláttur - Jarðgöng'!$L$6:$L184,$B51,'Innsláttur - Jarðgöng'!X$6:X$170)","v":0},{"$f":"SUMIF('Innsláttur - Jarðgöng'!$L$6:$L184,$B51,'Innsláttur - Jarðgöng'!Y$6:Y$170)","v":0},{"$f":"SUMIF('Innsláttur - Jarðgöng'!$L$6:$L184,$B51,'Innsláttur - Jarðgöng'!Z$6:Z$170)","v":0},{"$f":"SUMIF('Innsláttur - Jarðgöng'!$L$6:$L184,$B51,'Innsláttur - Jarðgöng'!AA$6:AA$170)","v":0},{"$f":"SUMIF('Innsláttur - Jarðgöng'!$L$6:$L184,$B51,'Innsláttur - Jarðgöng'!AB$6:AB$170)","v":0}]
[null,"45.6 Niðurföll / sandfang",{"$f":"SUMIF('Innsláttur - Jarðgöng'!$L$6:$L185,$B52,'Innsláttur - Jarðgöng'!W$6:W$170)","v":0},{"$f":"SUMIF('Innsláttur - Jarðgöng'!$L$6:$L185,$B52,'Innsláttur - Jarðgöng'!X$6:X$170)","v":0},{"$f":"SUMIF('Innsláttur - Jarðgöng'!$L$6:$L185,$B52,'Innsláttur - Jarðgöng'!Y$6:Y$170)","v":0},{"$f":"SUMIF('Innsláttur - Jarðgöng'!$L$6:$L185,$B52,'Innsláttur - Jarðgöng'!Z$6:Z$170)","v":0},{"$f":"SUMIF('Innsláttur - Jarðgöng'!$L$6:$L185,$B52,'Innsláttur - Jarðgöng'!AA$6:AA$170)","v":0},{"$f":"SUMIF('Innsláttur - Jarðgöng'!$L$6:$L185,$B52,'Innsláttur - Jarðgöng'!AB$6:AB$170)","v":0}]
[null,"45.68 Grjótsvelgur",{"$f":"SUMIF('Innsláttur - Jarðgöng'!$L$6:$L186,$B53,'Innsláttur - Jarðgöng'!W$6:W$170)","v":0},{"$f":"SUMIF('Innsláttur - Jarðgöng'!$L$6:$L186,$B53,'Innsláttur - Jarðgöng'!X$6:X$170)","v":0},{"$f":"SUMIF('Innsláttur - Jarðgöng'!$L$6:$L186,$B53,'Innsláttur - Jarðgöng'!Y$6:Y$170)","v":0},{"$f":"SUMIF('Innsláttur - Jarðgöng'!$L$6:$L186,$B53,'Innsláttur - Jarðgöng'!Z$6:Z$170)","v":0},{"$f":"SUMIF('Innsláttur - Jarðgöng'!$L$6:$L186,$B53,'Innsláttur - Jarðgöng'!AA$6:AA$170)","v":0},{"$f":"SUMIF('Innsláttur - Jarðgöng'!$L$6:$L186,$B53,'Innsláttur - Jarðgöng'!AB$6:AB$170)","v":0}]
[null,"45.1 + 45.8 Gröftur lagnaskurða og fylling í skurði",{"$f":"SUMIF('Innsláttur - Jarðgöng'!$L$6:$L187,$B54,'Innsláttur - Jarðgöng'!W$6:W$170)","v":0},{"$f":"SUMIF('Innsláttur - Jarðgöng'!$L$6:$L187,$B54,'Innsláttur - Jarðgöng'!X$6:X$170)","v":0},{"$f":"SUMIF('Innsláttur - Jarðgöng'!$L$6:$L187,$B54,'Innsláttur - Jarðgöng'!Y$6:Y$170)","v":0},{"$f":"SUMIF('Innsláttur - Jarðgöng'!$L$6:$L187,$B54,'Innsláttur - Jarðgöng'!Z$6:Z$170)","v":0},{"$f":"SUMIF('Innsláttur - Jarðgöng'!$L$6:$L187,$B54,'Innsláttur - Jarðgöng'!AA$6:AA$170)","v":0},{"$f":"SUMIF('Innsláttur - Jarðgöng'!$L$6:$L187,$B54,'Innsláttur - Jarðgöng'!AB$6:AB$170)","v":0}]
[null,"Rafstrengir",{"$f":"SUMIF('Innsláttur - Jarðgöng'!$L$6:$L188,$B55,'Innsláttur - Jarðgöng'!W$6:W$170)","v":0},{"$f":"SUMIF('Innsláttur - Jarðgöng'!$L$6:$L188,$B55,'Innsláttur - Jarðgöng'!X$6:X$170)","v":0},{"$f":"SUMIF('Innsláttur - Jarðgöng'!$L$6:$L188,$B55,'Innsláttur - Jarðgöng'!Y$6:Y$170)","v":0},{"$f":"SUMIF('Innsláttur - Jarðgöng'!$L$6:$L188,$B55,'Innsláttur - Jarðgöng'!Z$6:Z$170)","v":0},{"$f":"SUMIF('Innsláttur - Jarðgöng'!$L$6:$L188,$B55,'Innsláttur - Jarðgöng'!AA$6:AA$170)","v":0},{"$f":"SUMIF('Innsláttur - Jarðgöng'!$L$6:$L188,$B55,'Innsláttur - Jarðgöng'!AB$6:AB$170)","v":0}]
[null,"52.2 Styrktarlag",{"$f":"SUMIF('Innsláttur - Jarðgöng'!$L$6:$L189,$B56,'Innsláttur - Jarðgöng'!W$6:W$170)","v":0},{"$f":"SUMIF('Innsláttur - Jarðgöng'!$L$6:$L189,$B56,'Innsláttur - Jarðgöng'!X$6:X$170)","v":0},{"$f":"SUMIF('Innsláttur - Jarðgöng'!$L$6:$L189,$B56,'Innsláttur - Jarðgöng'!Y$6:Y$170)","v":0},{"$f":"SUMIF('Innsláttur - Jarðgöng'!$L$6:$L189,$B56,'Innsláttur - Jarðgöng'!Z$6:Z$170)","v":0},{"$f":"SUMIF('Innsláttur - Jarðgöng'!$L$6:$L189,$B56,'Innsláttur - Jarðgöng'!AA$6:AA$170)","v":0},{"$f":"SUMIF('Innsláttur - Jarðgöng'!$L$6:$L189,$B56,'Innsláttur - Jarðgöng'!AB$6:AB$170)","v":0}]
[null,"53.1 Óbundið burðarlag",{"$f":"SUMIF('Innsláttur - Jarðgöng'!$L$6:$L190,$B57,'Innsláttur - Jarðgöng'!W$6:W$170)","v":0},{"$f":"SUMIF('Innsláttur - Jarðgöng'!$L$6:$L190,$B57,'Innsláttur - Jarðgöng'!X$6:X$170)","v":0},{"$f":"SUMIF('Innsláttur - Jarðgöng'!$L$6:$L190,$B57,'Innsláttur - Jarðgöng'!Y$6:Y$170)","v":0},{"$f":"SUMIF('Innsláttur - Jarðgöng'!$L$6:$L190,$B57,'Innsláttur - Jarðgöng'!Z$6:Z$170)","v":0},{"$f":"SUMIF('Innsláttur - Jarðgöng'!$L$6:$L190,$B57,'Innsláttur - Jarðgöng'!AA$6:AA$170)","v":0},{"$f":"SUMIF('Innsláttur - Jarðgöng'!$L$6:$L190,$B57,'Innsláttur - Jarðgöng'!AB$6:AB$170)","v":0}]
[null,"63.42 Burðarlagsmalbik",{"$f":"SUMIF('Innsláttur - Jarðgöng'!$L$6:$L191,$B58,'Innsláttur - Jarðgöng'!W$6:W$170)","v":0},{"$f":"SUMIF('Innsláttur - Jarðgöng'!$L$6:$L191,$B58,'Innsláttur - Jarðgöng'!X$6:X$170)","v":0},{"$f":"SUMIF('Innsláttur - Jarðgöng'!$L$6:$L191,$B58,'Innsláttur - Jarðgöng'!Y$6:Y$170)","v":0},{"$f":"SUMIF('Innsláttur - Jarðgöng'!$L$6:$L191,$B58,'Innsláttur - Jarðgöng'!Z$6:Z$170)","v":0},{"$f":"SUMIF('Innsláttur - Jarðgöng'!$L$6:$L191,$B58,'Innsláttur - Jarðgöng'!AA$6:AA$170)","v":0},{"$f":"SUMIF('Innsláttur - Jarðgöng'!$L$6:$L191,$B58,'Innsláttur - Jarðgöng'!AB$6:AB$170)","v":0}]
[null,"63.43 Slitlagsmalbik",{"$f":"SUMIF('Innsláttur - Jarðgöng'!$L$6:$L192,$B59,'Innsláttur - Jarðgöng'!W$6:W$170)","v":0},{"$f":"SUMIF('Innsláttur - Jarðgöng'!$L$6:$L192,$B59,'Innsláttur - Jarðgöng'!X$6:X$170)","v":0},{"$f":"SUMIF('Innsláttur - Jarðgöng'!$L$6:$L192,$B59,'Innsláttur - Jarðgöng'!Y$6:Y$170)","v":0},{"$f":"SUMIF('Innsláttur - Jarðgöng'!$L$6:$L192,$B59,'Innsláttur - Jarðgöng'!Z$6:Z$170)","v":0},{"$f":"SUMIF('Innsláttur - Jarðgöng'!$L$6:$L192,$B59,'Innsláttur - Jarðgöng'!AA$6:AA$170)","v":0},{"$f":"SUMIF('Innsláttur - Jarðgöng'!$L$6:$L192,$B59,'Innsláttur - Jarðgöng'!AB$6:AB$170)","v":0}]
[null,"68.24 Steypt gangstétt",{"$f":"SUMIF('Innsláttur - Jarðgöng'!$L$6:$L193,$B60,'Innsláttur - Jarðgöng'!W$6:W$170)","v":0},{"$f":"SUMIF('Innsláttur - Jarðgöng'!$L$6:$L193,$B60,'Innsláttur - Jarðgöng'!X$6:X$170)","v":0},{"$f":"SUMIF('Innsláttur - Jarðgöng'!$L$6:$L193,$B60,'Innsláttur - Jarðgöng'!Y$6:Y$170)","v":0},{"$f":"SUMIF('Innsláttur - Jarðgöng'!$L$6:$L193,$B60,'Innsláttur - Jarðgöng'!Z$6:Z$170)","v":0},{"$f":"SUMIF('Innsláttur - Jarðgöng'!$L$6:$L193,$B60,'Innsláttur - Jarðgöng'!AA$6:AA$170)","v":0},{"$f":"SUMIF('Innsláttur - Jarðgöng'!$L$6:$L193,$B60,'Innsláttur - Jarðgöng'!AB$6:AB$170)","v":0}]
[null,"68.25 Gangstígar/eyjarhringtorg með hellum",{"$f":"SUMIF('Innsláttur - Jarðgöng'!$L$6:$L194,$B61,'Innsláttur - Jarðgöng'!W$6:W$170)","v":0},{"$f":"SUMIF('Innsláttur - Jarðgöng'!$L$6:$L194,$B61,'Innsláttur - Jarðgöng'!X$6:X$170)","v":0},{"$f":"SUMIF('Innsláttur - Jarðgöng'!$L$6:$L194,$B61,'Innsláttur - Jarðgöng'!Y$6:Y$170)","v":0},{"$f":"SUMIF('Innsláttur - Jarðgöng'!$L$6:$L194,$B61,'Innsláttur - Jarðgöng'!Z$6:Z$170)","v":0},{"$f":"SUMIF('Innsláttur - Jarðgöng'!$L$6:$L194,$B61,'Innsláttur - Jarðgöng'!AA$6:AA$170)","v":0},{"$f":"SUMIF('Innsláttur - Jarðgöng'!$L$6:$L194,$B61,'Innsláttur - Jarðgöng'!AB$6:AB$170)","v":0}]
[null,"75.1 Kantsteinar",{"$f":"SUMIF('Innsláttur - Jarðgöng'!$L$6:$L195,$B62,'Innsláttur - Jarðgöng'!W$6:W$170)","v":0},{"$f":"SUMIF('Innsláttur - Jarðgöng'!$L$6:$L195,$B62,'Innsláttur - Jarðgöng'!X$6:X$170)","v":0},{"$f":"SUMIF('Innsláttur - Jarðgöng'!$L$6:$L195,$B62,'Innsláttur - Jarðgöng'!Y$6:Y$170)","v":0},{"$f":"SUMIF('Innsláttur - Jarðgöng'!$L$6:$L195,$B62,'Innsláttur - Jarðgöng'!Z$6:Z$170)","v":0},{"$f":"SUMIF('Innsláttur - Jarðgöng'!$L$6:$L195,$B62,'Innsláttur - Jarðgöng'!AA$6:AA$170)","v":0},{"$f":"SUMIF('Innsláttur - Jarðgöng'!$L$6:$L195,$B62,'Innsláttur - Jarðgöng'!AB$6:AB$170)","v":0}]
[null,"75.2 Eyjar og hringtorg",{"$f":"SUMIF('Innsláttur - Jarðgöng'!$L$6:$L196,$B63,'Innsláttur - Jarðgöng'!W$6:W$170)","v":0},{"$f":"SUMIF('Innsláttur - Jarðgöng'!$L$6:$L196,$B63,'Innsláttur - Jarðgöng'!X$6:X$170)","v":0},{"$f":"SUMIF('Innsláttur - Jarðgöng'!$L$6:$L196,$B63,'Innsláttur - Jarðgöng'!Y$6:Y$170)","v":0},{"$f":"SUMIF('Innsláttur - Jarðgöng'!$L$6:$L196,$B63,'Innsláttur - Jarðgöng'!Z$6:Z$170)","v":0},{"$f":"SUMIF('Innsláttur - Jarðgöng'!$L$6:$L196,$B63,'Innsláttur - Jarðgöng'!AA$6:AA$170)","v":0},{"$f":"SUMIF('Innsláttur - Jarðgöng'!$L$6:$L196,$B63,'Innsláttur - Jarðgöng'!AB$6:AB$170)","v":0}]
[null,"75.6 Vegrið",{"$f":"SUMIF('Innsláttur - Jarðgöng'!$L$6:$L197,$B64,'Innsláttur - Jarðgöng'!W$6:W$170)","v":0},{"$f":"SUMIF('Innsláttur - Jarðgöng'!$L$6:$L197,$B64,'Innsláttur - Jarðgöng'!X$6:X$170)","v":0},{"$f":"SUMIF('Innsláttur - Jarðgöng'!$L$6:$L197,$B64,'Innsláttur - Jarðgöng'!Y$6:Y$170)","v":0},{"$f":"SUMIF('Innsláttur - Jarðgöng'!$L$6:$L197,$B64,'Innsláttur - Jarðgöng'!Z$6:Z$170)","v":0},{"$f":"SUMIF('Innsláttur - Jarðgöng'!$L$6:$L197,$B64,'Innsláttur - Jarðgöng'!AA$6:AA$170)","v":0},{"$f":"SUMIF('Innsláttur - Jarðgöng'!$L$6:$L197,$B64,'Innsláttur - Jarðgöng'!AB$6:AB$170)","v":0}]
[null,"76.45 Ljósastuarar",{"$f":"SUMIF('Innsláttur - Jarðgöng'!$L$6:$L198,$B65,'Innsláttur - Jarðgöng'!W$6:W$170)","v":0},{"$f":"SUMIF('Innsláttur - Jarðgöng'!$L$6:$L198,$B65,'Innsláttur - Jarðgöng'!X$6:X$170)","v":0},{"$f":"SUMIF('Innsláttur - Jarðgöng'!$L$6:$L198,$B65,'Innsláttur - Jarðgöng'!Y$6:Y$170)","v":0},{"$f":"SUMIF('Innsláttur - Jarðgöng'!$L$6:$L198,$B65,'Innsláttur - Jarðgöng'!Z$6:Z$170)","v":0},{"$f":"SUMIF('Innsláttur - Jarðgöng'!$L$6:$L198,$B65,'Innsláttur - Jarðgöng'!AA$6:AA$170)","v":0},{"$f":"SUMIF('Innsláttur - Jarðgöng'!$L$6:$L198,$B65,'Innsláttur - Jarðgöng'!AB$6:AB$170)","v":0}]
[null,"75.62 Vegrið á brú",{"$f":"SUMIF('Innsláttur - Jarðgöng'!$L$6:$L199,$B66,'Innsláttur - Jarðgöng'!W$6:W$170)","v":0},{"$f":"SUMIF('Innsláttur - Jarðgöng'!$L$6:$L199,$B66,'Innsláttur - Jarðgöng'!X$6:X$170)","v":0},{"$f":"SUMIF('Innsláttur - Jarðgöng'!$L$6:$L199,$B66,'Innsláttur - Jarðgöng'!Y$6:Y$170)","v":0},{"$f":"SUMIF('Innsláttur - Jarðgöng'!$L$6:$L199,$B66,'Innsláttur - Jarðgöng'!Z$6:Z$170)","v":0},{"$f":"SUMIF('Innsláttur - Jarðgöng'!$L$6:$L199,$B66,'Innsláttur - Jarðgöng'!AA$6:AA$170)","v":0},{"$f":"SUMIF('Innsláttur - Jarðgöng'!$L$6:$L199,$B66,'Innsláttur - Jarðgöng'!AB$6:AB$170)","v":0}]
[null,"75.7 Handrið",{"$f":"SUMIF('Innsláttur - Jarðgöng'!$L$6:$L200,$B67,'Innsláttur - Jarðgöng'!W$6:W$170)","v":0},{"$f":"SUMIF('Innsláttur - Jarðgöng'!$L$6:$L200,$B67,'Innsláttur - Jarðgöng'!X$6:X$170)","v":0},{"$f":"SUMIF('Innsláttur - Jarðgöng'!$L$6:$L200,$B67,'Innsláttur - Jarðgöng'!Y$6:Y$170)","v":0},{"$f":"SUMIF('Innsláttur - Jarðgöng'!$L$6:$L200,$B67,'Innsláttur - Jarðgöng'!Z$6:Z$170)","v":0},{"$f":"SUMIF('Innsláttur - Jarðgöng'!$L$6:$L200,$B67,'Innsláttur - Jarðgöng'!AA$6:AA$170)","v":0},{"$f":"SUMIF('Innsláttur - Jarðgöng'!$L$6:$L200,$B67,'Innsláttur - Jarðgöng'!AB$6:AB$170)","v":0}]
[null,"83.11 Bergboltar",{"$f":"SUMIF('Innsláttur - Jarðgöng'!$L$6:$L201,$B68,'Innsláttur - Jarðgöng'!W$6:W$170)","v":0},{"$f":"SUMIF('Innsláttur - Jarðgöng'!$L$6:$L201,$B68,'Innsláttur - Jarðgöng'!X$6:X$170)","v":0},{"$f":"SUMIF('Innsláttur - Jarðgöng'!$L$6:$L201,$B68,'Innsláttur - Jarðgöng'!Y$6:Y$170)","v":0},{"$f":"SUMIF('Innsláttur - Jarðgöng'!$L$6:$L201,$B68,'Innsláttur - Jarðgöng'!Z$6:Z$170)","v":0},{"$f":"SUMIF('Innsláttur - Jarðgöng'!$L$6:$L201,$B68,'Innsláttur - Jarðgöng'!AA$6:AA$170)","v":0},{"$f":"SUMIF('Innsláttur - Jarðgöng'!$L$6:$L201,$B68,'Innsláttur - Jarðgöng'!AB$6:AB$170)","v":0}]
[null,"83.212 Steyptir staurar",{"$f":"SUMIF('Innsláttur - Jarðgöng'!$L$6:$L202,$B69,'Innsláttur - Jarðgöng'!W$6:W$170)","v":0},{"$f":"SUMIF('Innsláttur - Jarðgöng'!$L$6:$L202,$B69,'Innsláttur - Jarðgöng'!X$6:X$170)","v":0},{"$f":"SUMIF('Innsláttur - Jarðgöng'!$L$6:$L202,$B69,'Innsláttur - Jarðgöng'!Y$6:Y$170)","v":0},{"$f":"SUMIF('Innsláttur - Jarðgöng'!$L$6:$L202,$B69,'Innsláttur - Jarðgöng'!Z$6:Z$170)","v":0},{"$f":"SUMIF('Innsláttur - Jarðgöng'!$L$6:$L202,$B69,'Innsláttur - Jarðgöng'!AA$6:AA$170)","v":0},{"$f":"SUMIF('Innsláttur - Jarðgöng'!$L$6:$L202,$B69,'Innsláttur - Jarðgöng'!AB$6:AB$170)","v":0}]
[null,"83.222 Tréstaurar",{"$f":"SUMIF('Innsláttur - Jarðgöng'!$L$6:$L203,$B70,'Innsláttur - Jarðgöng'!W$6:W$170)","v":0},{"$f":"SUMIF('Innsláttur - Jarðgöng'!$L$6:$L203,$B70,'Innsláttur - Jarðgöng'!X$6:X$170)","v":0},{"$f":"SUMIF('Innsláttur - Jarðgöng'!$L$6:$L203,$B70,'Innsláttur - Jarðgöng'!Y$6:Y$170)","v":0},{"$f":"SUMIF('Innsláttur - Jarðgöng'!$L$6:$L203,$B70,'Innsláttur - Jarðgöng'!Z$6:Z$170)","v":0},{"$f":"SUMIF('Innsláttur - Jarðgöng'!$L$6:$L203,$B70,'Innsláttur - Jarðgöng'!AA$6:AA$170)","v":0},{"$f":"SUMIF('Innsláttur - Jarðgöng'!$L$6:$L203,$B70,'Innsláttur - Jarðgöng'!AB$6:AB$170)","v":0}]
[null,"83.232 Stálstaurar",{"$f":"SUMIF('Innsláttur - Jarðgöng'!$L$6:$L204,$B71,'Innsláttur - Jarðgöng'!W$6:W$170)","v":0},{"$f":"SUMIF('Innsláttur - Jarðgöng'!$L$6:$L204,$B71,'Innsláttur - Jarðgöng'!X$6:X$170)","v":0},{"$f":"SUMIF('Innsláttur - Jarðgöng'!$L$6:$L204,$B71,'Innsláttur - Jarðgöng'!Y$6:Y$170)","v":0},{"$f":"SUMIF('Innsláttur - Jarðgöng'!$L$6:$L204,$B71,'Innsláttur - Jarðgöng'!Z$6:Z$170)","v":0},{"$f":"SUMIF('Innsláttur - Jarðgöng'!$L$6:$L204,$B71,'Innsláttur - Jarðgöng'!AA$6:AA$170)","v":0},{"$f":"SUMIF('Innsláttur - Jarðgöng'!$L$6:$L204,$B71,'Innsláttur - Jarðgöng'!AB$6:AB$170)","v":0}]
[null,"83.6 Stálþil",{"$f":"SUMIF('Innsláttur - Jarðgöng'!$L$6:$L205,$B72,'Innsláttur - Jarðgöng'!W$6:W$170)","v":0},{"$f":"SUMIF('Innsláttur - Jarðgöng'!$L$6:$L205,$B72,'Innsláttur - Jarðgöng'!X$6:X$170)","v":0},{"$f":"SUMIF('Innsláttur - Jarðgöng'!$L$6:$L205,$B72,'Innsláttur - Jarðgöng'!Y$6:Y$170)","v":0},{"$f":"SUMIF('Innsláttur - Jarðgöng'!$L$6:$L205,$B72,'Innsláttur - Jarðgöng'!Z$6:Z$170)","v":0},{"$f":"SUMIF('Innsláttur - Jarðgöng'!$L$6:$L205,$B72,'Innsláttur - Jarðgöng'!AA$6:AA$170)","v":0},{"$f":"SUMIF('Innsláttur - Jarðgöng'!$L$6:$L205,$B72,'Innsláttur - Jarðgöng'!AB$6:AB$170)","v":0}]
[null,"84.2 Mót",{"$f":"SUMIF('Innsláttur - Jarðgöng'!$L$6:$L206,$B73,'Innsláttur - Jarðgöng'!W$6:W$170)","v":0},{"$f":"SUMIF('Innsláttur - Jarðgöng'!$L$6:$L206,$B73,'Innsláttur - Jarðgöng'!X$6:X$170)","v":0},{"$f":"SUMIF('Innsláttur - Jarðgöng'!$L$6:$L206,$B73,'Innsláttur - Jarðgöng'!Y$6:Y$170)","v":0},{"$f":"SUMIF('Innsláttur - Jarðgöng'!$L$6:$L206,$B73,'Innsláttur - Jarðgöng'!Z$6:Z$170)","v":0},{"$f":"SUMIF('Innsláttur - Jarðgöng'!$L$6:$L206,$B73,'Innsláttur - Jarðgöng'!AA$6:AA$170)","v":0},{"$f":"SUMIF('Innsláttur - Jarðgöng'!$L$6:$L206,$B73,'Innsláttur - Jarðgöng'!AB$6:AB$170)","v":0}]
[null,"84.31 Slakbent járnalögn",{"$f":"SUMIF('Innsláttur - Jarðgöng'!$L$6:$L207,$B74,'Innsláttur - Jarðgöng'!W$6:W$170)","v":0},{"$f":"SUMIF('Innsláttur - Jarðgöng'!$L$6:$L207,$B74,'Innsláttur - Jarðgöng'!X$6:X$170)","v":0},{"$f":"SUMIF('Innsláttur - Jarðgöng'!$L$6:$L207,$B74,'Innsláttur - Jarðgöng'!Y$6:Y$170)","v":0},{"$f":"SUMIF('Innsláttur - Jarðgöng'!$L$6:$L207,$B74,'Innsláttur - Jarðgöng'!Z$6:Z$170)","v":0},{"$f":"SUMIF('Innsláttur - Jarðgöng'!$L$6:$L207,$B74,'Innsláttur - Jarðgöng'!AA$6:AA$170)","v":0},{"$f":"SUMIF('Innsláttur - Jarðgöng'!$L$6:$L207,$B74,'Innsláttur - Jarðgöng'!AB$6:AB$170)","v":0}]
[null,"84.36 Eftirspennt járnalögn",{"$f":"SUMIF('Innsláttur - Jarðgöng'!$L$6:$L208,$B75,'Innsláttur - Jarðgöng'!W$6:W$170)","v":0},{"$f":"SUMIF('Innsláttur - Jarðgöng'!$L$6:$L208,$B75,'Innsláttur - Jarðgöng'!X$6:X$170)","v":0},{"$f":"SUMIF('Innsláttur - Jarðgöng'!$L$6:$L208,$B75,'Innsláttur - Jarðgöng'!Y$6:Y$170)","v":0},{"$f":"SUMIF('Innsláttur - Jarðgöng'!$L$6:$L208,$B75,'Innsláttur - Jarðgöng'!Z$6:Z$170)","v":0},{"$f":"SUMIF('Innsláttur - Jarðgöng'!$L$6:$L208,$B75,'Innsláttur - Jarðgöng'!AA$6:AA$170)","v":0},{"$f":"SUMIF('Innsláttur - Jarðgöng'!$L$6:$L208,$B75,'Innsláttur - Jarðgöng'!AB$6:AB$170)","v":0}]
[null,"84.4 Steypa",{"$f":"SUMIF('Innsláttur - Jarðgöng'!$L$6:$L209,$B76,'Innsláttur - Jarðgöng'!W$6:W$170)","v":0},{"$f":"SUMIF('Innsláttur - Jarðgöng'!$L$6:$L209,$B76,'Innsláttur - Jarðgöng'!X$6:X$170)","v":0},{"$f":"SUMIF('Innsláttur - Jarðgöng'!$L$6:$L209,$B76,'Innsláttur - Jarðgöng'!Y$6:Y$170)","v":0},{"$f":"SUMIF('Innsláttur - Jarðgöng'!$L$6:$L209,$B76,'Innsláttur - Jarðgöng'!Z$6:Z$170)","v":0},{"$f":"SUMIF('Innsláttur - Jarðgöng'!$L$6:$L209,$B76,'Innsláttur - Jarðgöng'!AA$6:AA$170)","v":0},{"$f":"SUMIF('Innsláttur - Jarðgöng'!$L$6:$L209,$B76,'Innsláttur - Jarðgöng'!AB$6:AB$170)","v":0}]
[null,"84.57 Vatnsvarnalag undir malbiki",{"$f":"SUMIF('Innsláttur - Jarðgöng'!$L$6:$L210,$B77,'Innsláttur - Jarðgöng'!W$6:W$170)","v":0},{"$f":"SUMIF('Innsláttur - Jarðgöng'!$L$6:$L210,$B77,'Innsláttur - Jarðgöng'!X$6:X$170)","v":0},{"$f":"SUMIF('Innsláttur - Jarðgöng'!$L$6:$L210,$B77,'Innsláttur - Jarðgöng'!Y$6:Y$170)","v":0},{"$f":"SUMIF('Innsláttur - Jarðgöng'!$L$6:$L210,$B77,'Innsláttur - Jarðgöng'!Z$6:Z$170)","v":0},{"$f":"SUMIF('Innsláttur - Jarðgöng'!$L$6:$L210,$B77,'Innsláttur - Jarðgöng'!AA$6:AA$170)","v":0},{"$f":"SUMIF('Innsláttur - Jarðgöng'!$L$6:$L210,$B77,'Innsláttur - Jarðgöng'!AB$6:AB$170)","v":0}]
[null,"85.1 Stálvirki",{"$f":"SUMIF('Innsláttur - Jarðgöng'!$L$6:$L211,$B78,'Innsláttur - Jarðgöng'!W$6:W$170)","v":0},{"$f":"SUMIF('Innsláttur - Jarðgöng'!$L$6:$L211,$B78,'Innsláttur - Jarðgöng'!X$6:X$170)","v":0},{"$f":"SUMIF('Innsláttur - Jarðgöng'!$L$6:$L211,$B78,'Innsláttur - Jarðgöng'!Y$6:Y$170)","v":0},{"$f":"SUMIF('Innsláttur - Jarðgöng'!$L$6:$L211,$B78,'Innsláttur - Jarðgöng'!Z$6:Z$170)","v":0},{"$f":"SUMIF('Innsláttur - Jarðgöng'!$L$6:$L211,$B78,'Innsláttur - Jarðgöng'!AA$6:AA$170)","v":0},{"$f":"SUMIF('Innsláttur - Jarðgöng'!$L$6:$L211,$B78,'Innsláttur - Jarðgöng'!AB$6:AB$170)","v":0}]
[null,"86.1 Legur",{"$f":"SUMIF('Innsláttur - Jarðgöng'!$L$6:$L212,$B79,'Innsláttur - Jarðgöng'!W$6:W$170)","v":0},{"$f":"SUMIF('Innsláttur - Jarðgöng'!$L$6:$L212,$B79,'Innsláttur - Jarðgöng'!X$6:X$170)","v":0},{"$f":"SUMIF('Innsláttur - Jarðgöng'!$L$6:$L212,$B79,'Innsláttur - Jarðgöng'!Y$6:Y$170)","v":0},{"$f":"SUMIF('Innsláttur - Jarðgöng'!$L$6:$L212,$B79,'Innsláttur - Jarðgöng'!Z$6:Z$170)","v":0},{"$f":"SUMIF('Innsláttur - Jarðgöng'!$L$6:$L212,$B79,'Innsláttur - Jarðgöng'!AA$6:AA$170)","v":0},{"$f":"SUMIF('Innsláttur - Jarðgöng'!$L$6:$L212,$B79,'Innsláttur - Jarðgöng'!AB$6:AB$170)","v":0}]
[null,"86.4 Þensluraufar",{"$f":"SUMIF('Innsláttur - Jarðgöng'!$L$6:$L213,$B80,'Innsláttur - Jarðgöng'!W$6:W$170)","v":0},{"$f":"SUMIF('Innsláttur - Jarðgöng'!$L$6:$L213,$B80,'Innsláttur - Jarðgöng'!X$6:X$170)","v":0},{"$f":"SUMIF('Innsláttur - Jarðgöng'!$L$6:$L213,$B80,'Innsláttur - Jarðgöng'!Y$6:Y$170)","v":0},{"$f":"SUMIF('Innsláttur - Jarðgöng'!$L$6:$L213,$B80,'Innsláttur - Jarðgöng'!Z$6:Z$170)","v":0},{"$f":"SUMIF('Innsláttur - Jarðgöng'!$L$6:$L213,$B80,'Innsláttur - Jarðgöng'!AA$6:AA$170)","v":0},{"$f":"SUMIF('Innsláttur - Jarðgöng'!$L$6:$L213,$B80,'Innsláttur - Jarðgöng'!AB$6:AB$170)","v":0}]
[null,"22.51 Gröftur í göngum",{"$f":"SUMIF('Innsláttur - Jarðgöng'!$L$6:$L214,$B81,'Innsláttur - Jarðgöng'!W$6:W$170)","v":0},{"$f":"SUMIF('Innsláttur - Jarðgöng'!$L$6:$L214,$B81,'Innsláttur - Jarðgöng'!X$6:X$170)","v":0},{"$f":"SUMIF('Innsláttur - Jarðgöng'!$L$6:$L214,$B81,'Innsláttur - Jarðgöng'!Y$6:Y$170)","v":0},{"$f":"SUMIF('Innsláttur - Jarðgöng'!$L$6:$L214,$B81,'Innsláttur - Jarðgöng'!Z$6:Z$170)","v":0},{"$f":"SUMIF('Innsláttur - Jarðgöng'!$L$6:$L214,$B81,'Innsláttur - Jarðgöng'!AA$6:AA$170)","v":0},{"$f":"SUMIF('Innsláttur - Jarðgöng'!$L$6:$L214,$B81,'Innsláttur - Jarðgöng'!AB$6:AB$170)","v":0}]
[null,"23.2 Borun könnunar og bergþéttingarhola",{"$f":"SUMIF('Innsláttur - Jarðgöng'!$L$6:$L215,$B82,'Innsláttur - Jarðgöng'!W$6:W$170)","v":0},{"$f":"SUMIF('Innsláttur - Jarðgöng'!$L$6:$L215,$B82,'Innsláttur - Jarðgöng'!X$6:X$170)","v":0},{"$f":"SUMIF('Innsláttur - Jarðgöng'!$L$6:$L215,$B82,'Innsláttur - Jarðgöng'!Y$6:Y$170)","v":0},{"$f":"SUMIF('Innsláttur - Jarðgöng'!$L$6:$L215,$B82,'Innsláttur - Jarðgöng'!Z$6:Z$170)","v":0},{"$f":"SUMIF('Innsláttur - Jarðgöng'!$L$6:$L215,$B82,'Innsláttur - Jarðgöng'!AA$6:AA$170)","v":0},{"$f":"SUMIF('Innsláttur - Jarðgöng'!$L$6:$L215,$B82,'Innsláttur - Jarðgöng'!AB$6:AB$170)","v":0}]
[null,"23.6 Bergþétting með sementsefju",{"$f":"SUMIF('Innsláttur - Jarðgöng'!$L$6:$L216,$B83,'Innsláttur - Jarðgöng'!W$6:W$170)","v":0},{"$f":"SUMIF('Innsláttur - Jarðgöng'!$L$6:$L216,$B83,'Innsláttur - Jarðgöng'!X$6:X$170)","v":0},{"$f":"SUMIF('Innsláttur - Jarðgöng'!$L$6:$L216,$B83,'Innsláttur - Jarðgöng'!Y$6:Y$170)","v":0},{"$f":"SUMIF('Innsláttur - Jarðgöng'!$L$6:$L216,$B83,'Innsláttur - Jarðgöng'!Z$6:Z$170)","v":0},{"$f":"SUMIF('Innsláttur - Jarðgöng'!$L$6:$L216,$B83,'Innsláttur - Jarðgöng'!AA$6:AA$170)","v":0},{"$f":"SUMIF('Innsláttur - Jarðgöng'!$L$6:$L216,$B83,'Innsláttur - Jarðgöng'!AB$6:AB$170)","v":0}]
[null,"25.2 Bergboltar",{"$f":"SUMIF('Innsláttur - Jarðgöng'!$L$6:$L217,$B84,'Innsláttur - Jarðgöng'!W$6:W$170)","v":0},{"$f":"SUMIF('Innsláttur - Jarðgöng'!$L$6:$L217,$B84,'Innsláttur - Jarðgöng'!X$6:X$170)","v":0},{"$f":"SUMIF('Innsláttur - Jarðgöng'!$L$6:$L217,$B84,'Innsláttur - Jarðgöng'!Y$6:Y$170)","v":0},{"$f":"SUMIF('Innsláttur - Jarðgöng'!$L$6:$L217,$B84,'Innsláttur - Jarðgöng'!Z$6:Z$170)","v":0},{"$f":"SUMIF('Innsláttur - Jarðgöng'!$L$6:$L217,$B84,'Innsláttur - Jarðgöng'!AA$6:AA$170)","v":0},{"$f":"SUMIF('Innsláttur - Jarðgöng'!$L$6:$L217,$B84,'Innsláttur - Jarðgöng'!AB$6:AB$170)","v":0}]
[null,"25.4 Sprautusteypa",{"$f":"SUMIF('Innsláttur - Jarðgöng'!$L$6:$L218,$B85,'Innsláttur - Jarðgöng'!W$6:W$170)","v":0},{"$f":"SUMIF('Innsláttur - Jarðgöng'!$L$6:$L218,$B85,'Innsláttur - Jarðgöng'!X$6:X$170)","v":0},{"$f":"SUMIF('Innsláttur - Jarðgöng'!$L$6:$L218,$B85,'Innsláttur - Jarðgöng'!Y$6:Y$170)","v":0},{"$f":"SUMIF('Innsláttur - Jarðgöng'!$L$6:$L218,$B85,'Innsláttur - Jarðgöng'!Z$6:Z$170)","v":0},{"$f":"SUMIF('Innsláttur - Jarðgöng'!$L$6:$L218,$B85,'Innsláttur - Jarðgöng'!AA$6:AA$170)","v":0},{"$f":"SUMIF('Innsláttur - Jarðgöng'!$L$6:$L218,$B85,'Innsláttur - Jarðgöng'!AB$6:AB$170)","v":0}]
[null,"25.62 Járnalögn",{"$f":"SUMIF('Innsláttur - Jarðgöng'!$L$6:$L219,$B86,'Innsláttur - Jarðgöng'!W$6:W$170)","v":0},{"$f":"SUMIF('Innsláttur - Jarðgöng'!$L$6:$L219,$B86,'Innsláttur - Jarðgöng'!X$6:X$170)","v":0},{"$f":"SUMIF('Innsláttur - Jarðgöng'!$L$6:$L219,$B86,'Innsláttur - Jarðgöng'!Y$6:Y$170)","v":0},{"$f":"SUMIF('Innsláttur - Jarðgöng'!$L$6:$L219,$B86,'Innsláttur - Jarðgöng'!Z$6:Z$170)","v":0},{"$f":"SUMIF('Innsláttur - Jarðgöng'!$L$6:$L219,$B86,'Innsláttur - Jarðgöng'!AA$6:AA$170)","v":0},{"$f":"SUMIF('Innsláttur - Jarðgöng'!$L$6:$L219,$B86,'Innsláttur - Jarðgöng'!AB$6:AB$170)","v":0}]
[null,"26.3 Dúkur undir sprautusteypu",{"$f":"SUMIF('Innsláttur - Jarðgöng'!$L$6:$L220,$B87,'Innsláttur - Jarðgöng'!W$6:W$170)","v":0},{"$f":"SUMIF('Innsláttur - Jarðgöng'!$L$6:$L220,$B87,'Innsláttur - Jarðgöng'!X$6:X$170)","v":0},{"$f":"SUMIF('Innsláttur - Jarðgöng'!$L$6:$L220,$B87,'Innsláttur - Jarðgöng'!Y$6:Y$170)","v":0},{"$f":"SUMIF('Innsláttur - Jarðgöng'!$L$6:$L220,$B87,'Innsláttur - Jarðgöng'!Z$6:Z$170)","v":0},{"$f":"SUMIF('Innsláttur - Jarðgöng'!$L$6:$L220,$B87,'Innsláttur - Jarðgöng'!AA$6:AA$170)","v":0},{"$f":"SUMIF('Innsláttur - Jarðgöng'!$L$6:$L220,$B87,'Innsláttur - Jarðgöng'!AB$6:AB$170)","v":0}]
[null,"26.1 Einangrunarklæðing undir sprautusteypu",{"$f":"SUMIF('Innsláttur - Jarðgöng'!$L$6:$L221,$B88,'Innsláttur - Jarðgöng'!W$6:W$170)","v":0},{"$f":"SUMIF('Innsláttur - Jarðgöng'!$L$6:$L221,$B88,'Innsláttur - Jarðgöng'!X$6:X$170)","v":0},{"$f":"SUMIF('Innsláttur - Jarðgöng'!$L$6:$L221,$B88,'Innsláttur - Jarðgöng'!Y$6:Y$170)","v":0},{"$f":"SUMIF('Innsláttur - Jarðgöng'!$L$6:$L221,$B88,'Innsláttur - Jarðgöng'!Z$6:Z$170)","v":0},{"$f":"SUMIF('Innsláttur - Jarðgöng'!$L$6:$L221,$B88,'Innsláttur - Jarðgöng'!AA$6:AA$170)","v":0},{"$f":"SUMIF('Innsláttur - Jarðgöng'!$L$6:$L221,$B88,'Innsláttur - Jarðgöng'!AB$6:AB$170)","v":0}]
[null,"Samtals",{"$f":"SUM(C39:C88)","v":0},0,0,0,0,0]

{"sheet":"Niðurstöður - Gönguleiðir","index":10,"n_rows":63,"n_cols":26,"rows_kept":63,"cut":false,"hidden":false,"merged":[[17,2,17,7],[19,11,19,15],[28,21,28,25],[29,1,29,7],[31,2,31,7],[6,11,6,16],[7,11,7,16],[8,11,8,16],[2,21,2,23],[15,1,15,7],[10,11,10,16],[14,14,14,16],[15,14,15,16],[14,11,14,12],[15,11,15,12],[3,1,3,7],[5,2,5,7],[3,11,3,16],[4,11,4,16],[5,11,5,16],[12,13,12,15]]}
[]
[null,"Niðurstöður - Gönguleiðir",null,null,null,null,null,null,null,null,"Skýrsla - Gönguleiðir"]
[null,null,null,null,null,null,null,null,null,null,null,null,null,null,null,null,null,null,null,null,null,"kg CO2-ígildi"]
[null,"Niðurstöður kolefnisútreikninga, deilt niður á yfirverkþætti og vistferilsfasa",null,null,null,null,null,null,null,null,"Nafn verkefnis",{"$f":"IF(ISBLANK(Forsíða!D5),\"\",Forsíða!D5)","v":""},null,null,null,null,null,null,null,null,null,"Heild","Per km","per m2"]
[null,null,null,null,null,null,null,null,null,null,"Veghluti","Gönguleiðir",null,null,null,null,null,null,null,null,"A1-A3",{"$f":"L27","v":0},{"$f":"V5/($L$13/1000)","v":{"$error":"#DIV/0!"}},{"$f":"V5/$Q$13","v":{"$error":"#DIV/0!"}}]
[null,null,"kg CO2-ígildi",null,null,null,null,null,null,null,"Staðsetning",{"$f":"IF(ISBLANK(Forsíða!D6),\"\",Forsíða!D6)","v":""},null,null,null,null,null,null,null,null,"A4",{"$f":"M27","v":0},{"$f":"V6/($L$13/1000)","v":{"$error":"#DIV/0!"}},{"$f":"V6/$Q$13","v":{"$error":"#DIV/0!"}}]
[null,null,"A1-A3","A4","A5","A1-A5","B4","A1-A5 + B4",null,null,"Dagsetning greiningar",{"$f":"IF(ISBLANK(Forsíða!D7),\"\",Forsíða!D7)","v":"dd.mm.yyyy"},null,null,null,null,null,null,null,null,"A5",{"$f":"N27","v":0},{"$error":"#DIV/0!"},{"$f":"V7/$Q$13","v":{"$error":"#DIV/0!"}}]
[null,"Skeringar og undirbygging",{"$f":"SUMIF('Innsláttur - Gönguleiðir'!$K$6:$K$130,$B8,'Innsláttur - Gönguleiðir'!W$6:W$130)","v":0},{"$f":"SUMIF('Innsláttur - Gönguleiðir'!$K$6:$K$130,$B8,'Innsláttur - Gönguleiðir'!X$6:X$130)","v":0},{"$f":"SUMIF('Innsláttur - Gönguleiðir'!$K$6:$K$130,$B8,'Innsláttur - Gönguleiðir'!Y$6:Y$130)","v":0},{"$f":"SUMIF('Innsláttur - Gönguleiðir'!$K$6:$K$130,$B8,'Innsláttur - Gönguleiðir'!Z$6:Z$130)","v":0},{"$f":"SUMIF('Innsláttur - Gönguleiðir'!$K$6:$K$130,$B8,'Innsláttur - Gönguleiðir'!AA$6:AA$130)","v":0},{"$f":"SUMIF('Innsláttur - Gönguleiðir'!$K$6:$K$130,$B8,'Innsláttur - Gönguleiðir'!AB$6:AB$130)","v":0},null,null,"Greiningartími (ár)",{"$f":"IF(ISBLANK(Forsíða!D8),\"\",Forsíða!D8)","v":60},null,null,null,null,null,null,null,null,"B4",{"$f":"O27","v":0},{"$error":"#DIV/0!"},{"$f":"V8/$Q$13","v":{"$error":"#DIV/0!"}}]
[null,"Ræsi og veitur",{"$f":"SUMIF('Innsláttur - Gönguleiðir'!$K$6:$K$130,$B9,'Innsláttur - Gönguleiðir'!W$6:W$130)","v":0},{"$f":"SUMIF('Innsláttur - Gönguleiðir'!$K$6:$K$130,$B9,'Innsláttur - Gönguleiðir'!X$6:X$130)","v":0},{"$f":"SUMIF('Innsláttur - Gönguleiðir'!$K$6:$K$130,$B9,'Innsláttur - Gönguleiðir'!Y$6:Y$130)","v":0},{"$f":"SUMIF('Innsláttur - Gönguleiðir'!$K$6:$K$130,$B9,'Innsláttur - Gönguleiðir'!Z$6:Z$130)","v":0},{"$f":"SUMIF('Innsláttur - Gönguleiðir'!$K$6:$K$130,$B9,'Innsláttur - Gönguleiðir'!AA$6:AA$130)","v":0},{"$f":"SUMIF('Innsláttur - Gönguleiðir'!$K$6:$K$130,$B9,'Innsláttur - Gönguleiðir'!AB$6:AB$130)","v":0},null,null,"Unnið af",{"$f":"IF(ISBLANK(Forsíða!D9),\"\",Forsíða!D9)","v":""},null,null,null,null,null,null,null,null,"Samtals",{"$f":"SUM(V5:V8)","v":0},{"$f":"SUM(W5:W8)","v":{"$error":"#DIV/0!"}},{"$error":"#DIV/0!"}]
[null,"Styrktar- og burðarlög",{"$f":"SUMIF('Innsláttur - Gönguleiðir'!$K$6:$K$130,$B10,'Innsláttur - Gönguleiðir'!W$6:W$130)","v":0},{"$f":"SUMIF('Innsláttur - Gönguleiðir'!$K$6:$K$130,$B10,'Innsláttur - Gönguleiðir'!X$6:X$130)","v":0},{"$f":"SUMIF('Innsláttur - Gönguleiðir'!$K$6:$K$130,$B10,'Innsláttur - Gönguleiðir'!Y$6:Y$130)","v":0},{"$f":"SUMIF('Innsláttur - Gönguleiðir'!$K$6:$K$130,$B10,'Innsláttur - Gönguleiðir'!Z$6:Z$130)","v":0},{"$f":"SUMIF('Innsláttur - Gönguleiðir'!$K$6:$K$130,$B10,'Innsláttur - Gönguleiðir'!AA$6:AA$130)","v":0},{"$f":"SUMIF('Innsláttur - Gönguleiðir'!$K$6:$K$130,$B10,'Innsláttur - Gönguleiðir'!AB$6:AB$130)","v":0}]
[null,"Slitlög",{"$f":"SUMIF('Innsláttur - Gönguleiðir'!$K$6:$K$130,$B11,'Innsláttur - Gönguleiðir'!W$6:W$130)","v":0},{"$f":"SUMIF('Innsláttur - Gönguleiðir'!$K$6:$K$130,$B11,'Innsláttur - Gönguleiðir'!X$6:X$130)","v":0},{"$f":"SUMIF('Innsláttur - Gönguleiðir'!$K$6:$K$130,$B11,'Innsláttur - Gönguleiðir'!Y$6:Y$130)","v":0},{"$f":"SUMIF('Innsláttur - Gönguleiðir'!$K$6:$K$130,$B11,'Innsláttur - Gönguleiðir'!Z$6:Z$130)","v":0},{"$f":"SUMIF('Innsláttur - Gönguleiðir'!$K$6:$K$130,$B11,'Innsláttur - Gönguleiðir'!AA$6:AA$130)","v":0},{"$f":"SUMIF('Innsláttur - Gönguleiðir'!$K$6:$K$130,$B11,'Innsláttur - Gönguleiðir'!AB$6:AB$130)","v":0},null,null,"Framkvæmdarstig",{"$f":"Forsíða!D12","v":"Veldu framkvæmdarstig"}]
[null,"Öryggisbúnaður og frágangur",{"$f":"SUMIF('Innsláttur - Gönguleiðir'!$K$6:$K$130,$B12,'Innsláttur - Gönguleiðir'!W$6:W$130)","v":0},{"$f":"SUMIF('Innsláttur - Gönguleiðir'!$K$6:$K$130,$B12,'Innsláttur - Gönguleiðir'!X$6:X$130)","v":0},{"$f":"SUMIF('Innsláttur - Gönguleiðir'!$K$6:$K$130,$B12,'Innsláttur - Gönguleiðir'!Y$6:Y$130)","v":0},{"$f":"SUMIF('Innsláttur - Gönguleiðir'!$K$6:$K$130,$B12,'Innsláttur - Gönguleiðir'!Z$6:Z$130)","v":0},{"$f":"SUMIF('Innsláttur - Gönguleiðir'!$K$6:$K$130,$B12,'Innsláttur - Gönguleiðir'!AA$6:AA$130)","v":0},{"$f":"SUMIF('Innsláttur - Gönguleiðir'!$K$6:$K$130,$B12,'Innsláttur - Gönguleiðir'!AB$6:AB$130)","v":0}]
[null,"Samtals",{"$f":"SUM(C8:C12)","v":0},0,0,0,0,0,null,null,"Heildarlengd gönguleiða [m]",{"$f":"Forsíða!D17","v":0},null,"Heildarflatarmál gönguleiða [m2]",null,null,{"$f":"Forsíða!G17","v":0}]
[]
[null,null,null,null,null,null,null,null,null,null,"Útreiknað heildarkolefnisspor",{"$f":"MROUND(V9/1000,10)&\" tonn CO2-ígildi\"","v":"0 tonn CO2-ígildi"},null,"Óvissubil",{"$f":"IF(L11=Sheet2!P7,\"Engin áætluð óvissa\",MROUND(V9*_xlfn.XLOOKUP(L11,Sheet2!P3:P7,Sheet2!Q3:Q7)/1000,10)&\" - \"&MROUND(V9*_xlfn.XLOOKUP(L11,Sheet2!P3:P7,Sheet2!R3:R7)/1000,10)&\" tonn CO2-ígildi\")","v":{"$error":"#N/A"}}]
[null,"Niðurstöður kolefnisútreikninga, skipt niður á efnisflokka og vistferilsfasa",null,null,null,null,null,null,null,null,"Útreiknað kolefnisspor á m2",{"$f":"MROUND(X9,1)&\" kg CO2-ígildi/m2\"","v":{"$error":"#DIV/0!"}},null,"Óvissubil",{"$f":"IF(L11=Sheet2!P7,\"Engin áætluð óvissa\",MROUND(V9*_xlfn.XLOOKUP(L11,Sheet2!P3:P7,Sheet2!Q3:Q7)/Q13,1)&\" - \"&MROUND(V9*_xlfn.XLOOKUP(L11,Sheet2!P3:P7,Sheet2!R3:R7)/Q13,1)&\" kg CO2-ígildi/m2\")","v":{"$error":"#N/A"}}]
[]
[null,null,"kg CO2-ígildi"]
[null,null,"A1-A3","A4","A5","A1-A5","B4","A1-A5 + B4"]
[null,"Jarðvinna",{"$f":"SUMIF('Innsláttur - Gönguleiðir'!$I$6:$I130,$B20,'Innsláttur - Gönguleiðir'!W$6:W$130)","v":0},{"$f":"SUMIF('Innsláttur - Gönguleiðir'!$I$6:$I130,$B20,'Innsláttur - Gönguleiðir'!X$6:X$130)","v":0},{"$f":"SUMIF('Innsláttur - Gönguleiðir'!$I$6:$I130,$B20,'Innsláttur - Gönguleiðir'!Y$6:Y$130)-SUMIF('Innsláttur - Gönguleiðir'!$I$6:$I130,$B20,'Innsláttur - Gönguleiðir'!S$6:S$130)*EF_oil","v":0},{"$f":"SUM(C20:E20)","v":0},{"$f":"SUMIF('Innsláttur - Gönguleiðir'!$I$6:$I130,$B20,'Innsláttur - Gönguleiðir'!AA$6:AA$130)","v":0},{"$f":"SUMIF('Innsláttur - Gönguleiðir'!$I$6:$I130,$B20,'Innsláttur - Gönguleiðir'!AB$6:AB$130)","v":0},null,null,null,"kg CO2-ígildi"]
[null,"Plast",{"$f":"SUMIF('Innsláttur - Gönguleiðir'!$I$6:$I131,$B21,'Innsláttur - Gönguleiðir'!W$6:W$130)","v":0},{"$f":"SUMIF('Innsláttur - Gönguleiðir'!$I$6:$I131,$B21,'Innsláttur - Gönguleiðir'!X$6:X$130)","v":0},{"$f":"SUMIF('Innsláttur - Gönguleiðir'!$I$6:$I131,$B21,'Innsláttur - Gönguleiðir'!Y$6:Y$130)-SUMIF('Innsláttur - Gönguleiðir'!$I$6:$I131,$B21,'Innsláttur - Gönguleiðir'!S$6:S$130)*EF_oil","v":0},{"$f":"SUM(C21:E21)","v":0},{"$f":"SUMIF('Innsláttur - Gönguleiðir'!$I$6:$I131,$B21,'Innsláttur - Gönguleiðir'!AA$6:AA$130)","v":0},{"$f":"SUMIF('Innsláttur - Gönguleiðir'!$I$6:$I131,$B21,'Innsláttur - Gönguleiðir'!AB$6:AB$130)","v":0},null,null,null,"A1-A3","A4","A5","B4","Samtals"]
[null,"Stál",{"$f":"SUMIF('Innsláttur - Gönguleiðir'!$I$6:$I132,$B22,'Innsláttur - Gönguleiðir'!W$6:W$130)","v":0},{"$f":"SUMIF('Innsláttur - Gönguleiðir'!$I$6:$I132,$B22,'Innsláttur - Gönguleiðir'!X$6:X$130)","v":0},{"$f":"SUMIF('Innsláttur - Gönguleiðir'!$I$6:$I132,$B22,'Innsláttur - Gönguleiðir'!Y$6:Y$130)-SUMIF('Innsláttur - Gönguleiðir'!$I$6:$I132,$B22,'Innsláttur - Gönguleiðir'!S$6:S$130)*EF_oil","v":0},0,{"$f":"SUMIF('Innsláttur - Gönguleiðir'!$I$6:$I132,$B22,'Innsláttur - Gönguleiðir'!AA$6:AA$130)","v":0},{"$f":"SUMIF('Innsláttur - Gönguleiðir'!$I$6:$I132,$B22,'Innsláttur - Gönguleiðir'!AB$6:AB$130)","v":0},null,null,"Skeringar og undirbygging",{"$f":"C8","v":0},0,0,{"$f":"G8","v":0},{"$f":"SUM(L22:O22)","v":0}]
[null,"Steypa",{"$f":"SUMIF('Innsláttur - Gönguleiðir'!$I$6:$I133,$B23,'Innsláttur - Gönguleiðir'!W$6:W$130)","v":0},{"$f":"SUMIF('Innsláttur - Gönguleiðir'!$I$6:$I133,$B23,'Innsláttur - Gönguleiðir'!X$6:X$130)","v":0},{"$f":"SUMIF('Innsláttur - Gönguleiðir'!$I$6:$I133,$B23,'Innsláttur - Gönguleiðir'!Y$6:Y$130)-SUMIF('Innsláttur - Gönguleiðir'!$I$6:$I133,$B23,'Innsláttur - Gönguleiðir'!S$6:S$130)*EF_oil","v":0},0,{"$f":"SUMIF('Innsláttur - Gönguleiðir'!$I$6:$I133,$B23,'Innsláttur - Gönguleiðir'!AA$6:AA$130)","v":0},{"$f":"SUMIF('Innsláttur - Gönguleiðir'!$I$6:$I133,$B23,'Innsláttur - Gönguleiðir'!AB$6:AB$130)","v":0},null,null,"Ræsi og veitur",0,0,0,0,{"$f":"SUM(L23:O23)","v":0}]
[null,"Rafstrengur",{"$f":"SUMIF('Innsláttur - Gönguleiðir'!$I$6:$I134,$B24,'Innsláttur - Gönguleiðir'!W$6:W$130)","v":0},{"$f":"SUMIF('Innsláttur - Gönguleiðir'!$I$6:$I134,$B24,'Innsláttur - Gönguleiðir'!X$6:X$130)","v":0},{"$f":"SUMIF('Innsláttur - Gönguleiðir'!$I$6:$I134,$B24,'Innsláttur - Gönguleiðir'!Y$6:Y$130)-SUMIF('Innsláttur - Gönguleiðir'!$I$6:$I134,$B24,'Innsláttur - Gönguleiðir'!S$6:S$130)*EF_oil","v":0},0,{"$f":"SUMIF('Innsláttur - Gönguleiðir'!$I$6:$I134,$B24,'Innsláttur - Gönguleiðir'!AA$6:AA$130)","v":0},{"$f":"SUMIF('Innsláttur - Gönguleiðir'!$I$6:$I134,$B24,'Innsláttur - Gönguleiðir'!AB$6:AB$130)","v":0},null,null,"Styrktar- og burðarlög",0,0,0,0,0]
[null,"Malbik",{"$f":"SUMIF('Innsláttur - Gönguleiðir'!$I$6:$I136,$B25,'Innsláttur - Gönguleiðir'!W$6:W$130)","v":0},{"$f":"SUMIF('Innsláttur - Gönguleiðir'!$I$6:$I136,$B25,'Innsláttur - Gönguleiðir'!X$6:X$130)","v":0},{"$f":"SUMIF('Innsláttur - Gönguleiðir'!$I$6:$I136,$B25,'Innsláttur - Gönguleiðir'!Y$6:Y$130)-SUMIF('Innsláttur - Gönguleiðir'!$I$6:$I136,$B25,'Innsláttur - Gönguleiðir'!S$6:S$130)*EF_oil","v":0},0,{"$f":"SUMIF('Innsláttur - Gönguleiðir'!$I$6:$I136,$B25,'Innsláttur - Gönguleiðir'!AA$6:AA$130)","v":0},{"$f":"SUMIF('Innsláttur - Gönguleiðir'!$I$6:$I136,$B25,'Innsláttur - Gönguleiðir'!AB$6:AB$130)","v":0},null,null,"Slitlög",0,0,0,0,0]
[null,"Dísilolíunotkun á verkstað",{"$f":"SUMIF('Innsláttur - Gönguleiðir'!$I$6:$I141,$B26,'Innsláttur - Gönguleiðir'!W$6:W$130)","v":0},{"$f":"SUMIF('Innsláttur - Gönguleiðir'!$I$6:$I141,$B26,'Innsláttur - Gönguleiðir'!X$6:X$130)","v":0},{"$f":"'Innsláttur - Gönguleiðir'!S131*EF_oil","v":0},0,{"$f":"SUMIF('Innsláttur - Gönguleiðir'!$I$6:$I141,$B26,'Innsláttur - Gönguleiðir'!AA$6:AA$130)","v":0},{"$f":"SUMIF('Innsláttur - Gönguleiðir'!$I$6:$I141,$B26,'Innsláttur - Gönguleiðir'!AB$6:AB$130)","v":0},null,null,"Öryggisbúnaður og frágangur",0,0,0,0,0]
[null,"Samtals",{"$f":"SUM(C20:C26)","v":0},0,0,0,0,0,null,null,"Samtals",{"$f":"SUM(L22:L26)","v":0},{"$f":"SUM(M22:M26)","v":0},{"$f":"SUM(N22:N26)","v":0},0,0]
[]
[null,null,null,null,null,null,null,null,null,null,null,null,null,null,null,null,null,null,null,null,null,"kg CO2-ígildi"]
[null,"Niðurstöður kolefnisútreikninga, deilt niður á undirverkþætti og vistferilsfasa",null,null,null,null,null,null,null,null,null,null,null,null,null,null,null,null,null,null,null,"A1-A3","A4","A5","B4","Samtals"]
[null,null,null,null,null,null,null,null,null,null,null,null,null,null,null,null,null,null,null,null,"Jarðvinna",{"$f":"C20","v":0},0,0,{"$f":"G20","v":0},{"$f":"SUM(V31:Y31)","v":0}]
[null,null,"kg CO2-ígildi",null,null,null,null,null,null,null,null,null,null,null,null,null,null,null,null,null,"Plast",0,0,0,0,0]
[null,null,"A1-A3","A4","A5","A1-A5","B4","A1-A5 + B4",null,null,null,null,null,null,null,null,null,null,null,null,"Stál",0,0,0,0,0]
[null,"32.1 Bergskeringar í vegstæði",{"$f":"SUMIF('Innsláttur - Gönguleiðir'!$L$6:$L130,$B34,'Innsláttur - Gönguleiðir'!W$6:W$130)","v":0},{"$f":"SUMIF('Innsláttur - Gönguleiðir'!$L$6:$L130,$B34,'Innsláttur - Gönguleiðir'!X$6:X$130)","v":0},{"$f":"SUMIF('Innsláttur - Gönguleiðir'!$L$6:$L130,$B34,'Innsláttur - Gönguleiðir'!Y$6:Y$130)","v":0},{"$f":"SUMIF('Innsláttur - Gönguleiðir'!$L$6:$L130,$B34,'Innsláttur - Gönguleiðir'!Z$6:Z$130)","v":0},{"$f":"SUMIF('Innsláttur - Gönguleiðir'!$L$6:$L130,$B34,'Innsláttur - Gönguleiðir'!AA$6:AA$130)","v":0},{"$f":"SUMIF('Innsláttur - Gönguleiðir'!$L$6:$L130,$B34,'Innsláttur - Gönguleiðir'!AB$6:AB$130)","v":0},null,null,null,null,null,null,null,null,null,null,null,null,"Steypa",0,0,0,0,0]
[null,"32.2 Bergskeringar í námu",{"$f":"SUMIF('Innsláttur - Gönguleiðir'!$L$6:$L131,$B35,'Innsláttur - Gönguleiðir'!W$6:W$130)","v":0},{"$f":"SUMIF('Innsláttur - Gönguleiðir'!$L$6:$L131,$B35,'Innsláttur - Gönguleiðir'!X$6:X$130)","v":0},{"$f":"SUMIF('Innsláttur - Gönguleiðir'!$L$6:$L131,$B35,'Innsláttur - Gönguleiðir'!Y$6:Y$130)","v":0},{"$f":"SUMIF('Innsláttur - Gönguleiðir'!$L$6:$L131,$B35,'Innsláttur - Gönguleiðir'!Z$6:Z$130)","v":0},{"$f":"SUMIF('Innsláttur - Gönguleiðir'!$L$6:$L131,$B35,'Innsláttur - Gönguleiðir'!AA$6:AA$130)","v":0},{"$f":"SUMIF('Innsláttur - Gönguleiðir'!$L$6:$L131,$B35,'Innsláttur - Gönguleiðir'!AB$6:AB$130)","v":0},null,null,null,null,null,null,null,null,null,null,null,null,"Rafstrengur",0,0,0,0,0]
[null,"33.1 Fyllingarefni úr skeringum",{"$f":"SUMIF('Innsláttur - Gönguleiðir'!$L$6:$L132,$B36,'Innsláttur - Gönguleiðir'!W$6:W$130)","v":0},{"$f":"SUMIF('Innsláttur - Gönguleiðir'!$L$6:$L132,$B36,'Innsláttur - Gönguleiðir'!X$6:X$130)","v":0},{"$f":"SUMIF('Innsláttur - Gönguleiðir'!$L$6:$L132,$B36,'Innsláttur - Gönguleiðir'!Y$6:Y$130)","v":0},{"$f":"SUMIF('Innsláttur - Gönguleiðir'!$L$6:$L132,$B36,'Innsláttur - Gönguleiðir'!Z$6:Z$130)","v":0},{"$f":"SUMIF('Innsláttur - Gönguleiðir'!$L$6:$L132,$B36,'Innsláttur - Gönguleiðir'!AA$6:AA$130)","v":0},{"$f":"SUMIF('Innsláttur - Gönguleiðir'!$L$6:$L132,$B36,'Innsláttur - Gönguleiðir'!AB$6:AB$130)","v":0},null,null,null,null,null,null,null,null,null,null,null,null,"Malbik",0,0,0,0,0]
[null,"33.2 Fyllingarefni úr námu",{"$f":"SUMIF('Innsláttur - Gönguleiðir'!$L$6:$L133,$B37,'Innsláttur - Gönguleiðir'!W$6:W$130)","v":0},{"$f":"SUMIF('Innsláttur - Gönguleiðir'!$L$6:$L133,$B37,'Innsláttur - Gönguleiðir'!X$6:X$130)","v":0},{"$f":"SUMIF('Innsláttur - Gönguleiðir'!$L$6:$L133,$B37,'Innsláttur - Gönguleiðir'!Y$6:Y$130)","v":0},{"$f":"SUMIF('Innsláttur - Gönguleiðir'!$L$6:$L133,$B37,'Innsláttur - Gönguleiðir'!Z$6:Z$130)","v":0},{"$f":"SUMIF('Innsláttur - Gönguleiðir'!$L$6:$L133,$B37,'Innsláttur - Gönguleiðir'!AA$6:AA$130)","v":0},{"$f":"SUMIF('Innsláttur - Gönguleiðir'!$L$6:$L133,$B37,'Innsláttur - Gönguleiðir'!AB$6:AB$130)","v":0},null,null,null,null,null,null,null,null,null,null,null,null,"Dísilolíunotkun á verkstað",0,0,0,0,0]
[null,"34.1 Fláafleygar, efni úr skeringum",{"$f":"SUMIF('Innsláttur - Gönguleiðir'!$L$6:$L134,$B38,'Innsláttur - Gönguleiðir'!W$6:W$130)","v":0},{"$f":"SUMIF('Innsláttur - Gönguleiðir'!$L$6:$L134,$B38,'Innsláttur - Gönguleiðir'!X$6:X$130)","v":0},{"$f":"SUMIF('Innsláttur - Gönguleiðir'!$L$6:$L134,$B38,'Innsláttur - Gönguleiðir'!Y$6:Y$130)","v":0},{"$f":"SUMIF('Innsláttur - Gönguleiðir'!$L$6:$L134,$B38,'Innsláttur - Gönguleiðir'!Z$6:Z$130)","v":0},{"$f":"SUMIF('Innsláttur - Gönguleiðir'!$L$6:$L134,$B38,'Innsláttur - Gönguleiðir'!AA$6:AA$130)","v":0},{"$f":"SUMIF('Innsláttur - Gönguleiðir'!$L$6:$L134,$B38,'Innsláttur - Gönguleiðir'!AB$6:AB$130)","v":0},null,null,null,null,null,null,null,null,null,null,null,null,"Samtals",{"$f":"SUM(V31:V37)","v":0},{"$f":"SUM(W31:W37)","v":0},{"$f":"SUM(X31:X37)","v":0},{"$f":"SUM(Y31:Y37)","v":0},{"$f":"SUM(V38:Y38)","v":0}]
[null,"34.8 Ónothæfu efni jafnað á losunarstað",{"$f":"SUMIF('Innsláttur - Gönguleiðir'!$L$6:$L135,$B39,'Innsláttur - Gönguleiðir'!W$6:W$130)","v":0},{"$f":"SUMIF('Innsláttur - Gönguleiðir'!$L$6:$L135,$B39,'Innsláttur - Gönguleiðir'!X$6:X$130)","v":0},{"$f":"SUMIF('Innsláttur - Gönguleiðir'!$L$6:$L135,$B39,'Innsláttur - Gönguleiðir'!Y$6:Y$130)","v":0},{"$f":"SUMIF('Innsláttur - Gönguleiðir'!$L$6:$L135,$B39,'Innsláttur - Gönguleiðir'!Z$6:Z$130)","v":0},{"$f":"SUMIF('Innsláttur - Gönguleiðir'!$L$6:$L135,$B39,'Innsláttur - Gönguleiðir'!AA$6:AA$130)","v":0},{"$f":"SUMIF('Innsláttur - Gönguleiðir'!$L$6:$L135,$B39,'Innsláttur - Gönguleiðir'!AB$6:AB$130)","v":0}]
[null,"36.2 Grjótvörn",{"$f":"SUMIF('Innsláttur - Gönguleiðir'!$L$6:$L136,$B40,'Innsláttur - Gönguleiðir'!W$6:W$130)","v":0},{"$f":"SUMIF('Innsláttur - Gönguleiðir'!$L$6:$L136,$B40,'Innsláttur - Gönguleiðir'!X$6:X$130)","v":0},{"$f":"SUMIF('Innsláttur - Gönguleiðir'!$L$6:$L136,$B40,'Innsláttur - Gönguleiðir'!Y$6:Y$130)","v":0},{"$f":"SUMIF('Innsláttur - Gönguleiðir'!$L$6:$L136,$B40,'Innsláttur - Gönguleiðir'!Z$6:Z$130)","v":0},{"$f":"SUMIF('Innsláttur - Gönguleiðir'!$L$6:$L136,$B40,'Innsláttur - Gönguleiðir'!AA$6:AA$130)","v":0},{"$f":"SUMIF('Innsláttur - Gönguleiðir'!$L$6:$L136,$B40,'Innsláttur - Gönguleiðir'!AB$6:AB$130)","v":0}]
[null,"45.71 Plaströr, vatnsveita",{"$f":"SUMIF('Innsláttur - Gönguleiðir'!$L$6:$L139,$B41,'Innsláttur - Gönguleiðir'!W$6:W$130)","v":0},{"$f":"SUMIF('Innsláttur - Gönguleiðir'!$L$6:$L139,$B41,'Innsláttur - Gönguleiðir'!X$6:X$130)","v":0},{"$f":"SUMIF('Innsláttur - Gönguleiðir'!$L$6:$L139,$B41,'Innsláttur - Gönguleiðir'!Y$6:Y$130)","v":0},{"$f":"SUMIF('Innsláttur - Gönguleiðir'!$L$6:$L139,$B41,'Innsláttur - Gönguleiðir'!Z$6:Z$130)","v":0},{"$f":"SUMIF('Innsláttur - Gönguleiðir'!$L$6:$L139,$B41,'Innsláttur - Gönguleiðir'!AA$6:AA$130)","v":0},{"$f":"SUMIF('Innsláttur - Gönguleiðir'!$L$6:$L139,$B41,'Innsláttur - Gönguleiðir'!AB$6:AB$130)","v":0}]
[null,"42.3 Plaströr, fráveita",{"$f":"SUMIF('Innsláttur - Gönguleiðir'!$L$6:$L140,$B42,'Innsláttur - Gönguleiðir'!W$6:W$130)","v":0},{"$f":"SUMIF('Innsláttur - Gönguleiðir'!$L$6:$L140,$B42,'Innsláttur - Gönguleiðir'!X$6:X$130)","v":0},{"$f":"SUMIF('Innsláttur - Gönguleiðir'!$L$6:$L140,$B42,'Innsláttur - Gönguleiðir'!Y$6:Y$130)","v":0},{"$f":"SUMIF('Innsláttur - Gönguleiðir'!$L$6:$L140,$B42,'Innsláttur - Gönguleiðir'!Z$6:Z$130)","v":0},{"$f":"SUMIF('Innsláttur - Gönguleiðir'!$L$6:$L140,$B42,'Innsláttur - Gönguleiðir'!AA$6:AA$130)","v":0},{"$f":"SUMIF('Innsláttur - Gönguleiðir'!$L$6:$L140,$B42,'Innsláttur - Gönguleiðir'!AB$6:AB$130)","v":0}]
[null,"45.72 Hitaveiturör",{"$f":"SUMIF('Innsláttur - Gönguleiðir'!$L$6:$L141,$B43,'Innsláttur - Gönguleiðir'!W$6:W$130)","v":0},{"$f":"SUMIF('Innsláttur - Gönguleiðir'!$L$6:$L141,$B43,'Innsláttur - Gönguleiðir'!X$6:X$130)","v":0},{"$f":"SUMIF('Innsláttur - Gönguleiðir'!$L$6:$L141,$B43,'Innsláttur - Gönguleiðir'!Y$6:Y$130)","v":0},{"$f":"SUMIF('Innsláttur - Gönguleiðir'!$L$6:$L141,$B43,'Innsláttur - Gönguleiðir'!Z$6:Z$130)","v":0},{"$f":"SUMIF('Innsláttur - Gönguleiðir'!$L$6:$L141,$B43,'Innsláttur - Gönguleiðir'!AA$6:AA$130)","v":0},{"$f":"SUMIF('Innsláttur - Gönguleiðir'!$L$6:$L141,$B43,'Innsláttur - Gönguleiðir'!AB$6:AB$130)","v":0}]
[null,"42.4 Stálrör í ræsi",{"$f":"SUMIF('Innsláttur - Gönguleiðir'!$L$6:$L142,$B44,'Innsláttur - Gönguleiðir'!W$6:W$130)","v":0},{"$f":"SUMIF('Innsláttur - Gönguleiðir'!$L$6:$L142,$B44,'Innsláttur - Gönguleiðir'!X$6:X$130)","v":0},{"$f":"SUMIF('Innsláttur - Gönguleiðir'!$L$6:$L142,$B44,'Innsláttur - Gönguleiðir'!Y$6:Y$130)","v":0},{"$f":"SUMIF('Innsláttur - Gönguleiðir'!$L$6:$L142,$B44,'Innsláttur - Gönguleiðir'!Z$6:Z$130)","v":0},{"$f":"SUMIF('Innsláttur - Gönguleiðir'!$L$6:$L142,$B44,'Innsláttur - Gönguleiðir'!AA$6:AA$130)","v":0},{"$f":"SUMIF('Innsláttur - Gönguleiðir'!$L$6:$L142,$B44,'Innsláttur - Gönguleiðir'!AB$6:AB$130)","v":0}]
[null,"45.4 Steypt ofanvatnsræsi",{"$f":"SUMIF('Innsláttur - Gönguleiðir'!$L$6:$L143,$B45,'Innsláttur - Gönguleiðir'!W$6:W$130)","v":0},{"$f":"SUMIF('Innsláttur - Gönguleiðir'!$L$6:$L143,$B45,'Innsláttur - Gönguleiðir'!X$6:X$130)","v":0},{"$f":"SUMIF('Innsláttur - Gönguleiðir'!$L$6:$L143,$B45,'Innsláttur - Gönguleiðir'!Y$6:Y$130)","v":0},{"$f":"SUMIF('Innsláttur - Gönguleiðir'!$L$6:$L143,$B45,'Innsláttur - Gönguleiðir'!Z$6:Z$130)","v":0},{"$f":"SUMIF('Innsláttur - Gönguleiðir'!$L$6:$L143,$B45,'Innsláttur - Gönguleiðir'!AA$6:AA$130)","v":0},{"$f":"SUMIF('Innsláttur - Gönguleiðir'!$L$6:$L143,$B45,'Innsláttur - Gönguleiðir'!AB$6:AB$130)","v":0}]
[null,"45.5 Brunnar",{"$f":"SUMIF('Innsláttur - Gönguleiðir'!$L$6:$L144,$B46,'Innsláttur - Gönguleiðir'!W$6:W$130)","v":0},{"$f":"SUMIF('Innsláttur - Gönguleiðir'!$L$6:$L144,$B46,'Innsláttur - Gönguleiðir'!X$6:X$130)","v":0},{"$f":"SUMIF('Innsláttur - Gönguleiðir'!$L$6:$L144,$B46,'Innsláttur - Gönguleiðir'!Y$6:Y$130)","v":0},{"$f":"SUMIF('Innsláttur - Gönguleiðir'!$L$6:$L144,$B46,'Innsláttur - Gönguleiðir'!Z$6:Z$130)","v":0},{"$f":"SUMIF('Innsláttur - Gönguleiðir'!$L$6:$L144,$B46,'Innsláttur - Gönguleiðir'!AA$6:AA$130)","v":0},{"$f":"SUMIF('Innsláttur - Gönguleiðir'!$L$6:$L144,$B46,'Innsláttur - Gönguleiðir'!AB$6:AB$130)","v":0}]
[null,"45.6 Niðurföll / sandfang",{"$f":"SUMIF('Innsláttur - Gönguleiðir'!$L$6:$L145,$B47,'Innsláttur - Gönguleiðir'!W$6:W$130)","v":0},{"$f":"SUMIF('Innsláttur - Gönguleiðir'!$L$6:$L145,$B47,'Innsláttur - Gönguleiðir'!X$6:X$130)","v":0},{"$f":"SUMIF('Innsláttur - Gönguleiðir'!$L$6:$L145,$B47,'Innsláttur - Gönguleiðir'!Y$6:Y$130)","v":0},{"$f":"SUMIF('Innsláttur - Gönguleiðir'!$L$6:$L145,$B47,'Innsláttur - Gönguleiðir'!Z$6:Z$130)","v":0},{"$f":"SUMIF('Innsláttur - Gönguleiðir'!$L$6:$L145,$B47,'Innsláttur - Gönguleiðir'!AA$6:AA$130)","v":0},{"$f":"SUMIF('Innsláttur - Gönguleiðir'!$L$6:$L145,$B47,'Innsláttur - Gönguleiðir'!AB$6:AB$130)","v":0}]
[null,"45.68 Grjótsvelgur",{"$f":"SUMIF('Innsláttur - Gönguleiðir'!$L$6:$L146,$B48,'Innsláttur - Gönguleiðir'!W$6:W$130)","v":0},{"$f":"SUMIF('Innsláttur - Gönguleiðir'!$L$6:$L146,$B48,'Innsláttur - Gönguleiðir'!X$6:X$130)","v":0},{"$f":"SUMIF('Innsláttur - Gönguleiðir'!$L$6:$L146,$B48,'Innsláttur - Gönguleiðir'!Y$6:Y$130)","v":0},{"$f":"SUMIF('Innsláttur - Gönguleiðir'!$L$6:$L146,$B48,'Innsláttur - Gönguleiðir'!Z$6:Z$130)","v":0},{"$f":"SUMIF('Innsláttur - Gönguleiðir'!$L$6:$L146,$B48,'Innsláttur - Gönguleiðir'!AA$6:AA$130)","v":0},{"$f":"SUMIF('Innsláttur - Gönguleiðir'!$L$6:$L146,$B48,'Innsláttur - Gönguleiðir'!AB$6:AB$130)","v":0}]
[null,"45.1 + 45.8 Gröftur lagnaskurða og fylling í skurði",{"$f":"SUMIF('Innsláttur - Gönguleiðir'!$L$6:$L147,$B49,'Innsláttur - Gönguleiðir'!W$6:W$130)","v":0},{"$f":"SUMIF('Innsláttur - Gönguleiðir'!$L$6:$L147,$B49,'Innsláttur - Gönguleiðir'!X$6:X$130)","v":0},{"$f":"SUMIF('Innsláttur - Gönguleiðir'!$L$6:$L147,$B49,'Innsláttur - Gönguleiðir'!Y$6:Y$130)","v":0},{"$f":"SUMIF('Innsláttur - Gönguleiðir'!$L$6:$L147,$B49,'Innsláttur - Gönguleiðir'!Z$6:Z$130)","v":0},{"$f":"SUMIF('Innsláttur - Gönguleiðir'!$L$6:$L147,$B49,'Innsláttur - Gönguleiðir'!AA$6:AA$130)","v":0},{"$f":"SUMIF('Innsláttur - Gönguleiðir'!$L$6:$L147,$B49,'Innsláttur - Gönguleiðir'!AB$6:AB$130)","v":0}]
[null,"Rafstrengir",{"$f":"SUMIF('Innsláttur - Gönguleiðir'!$L$6:$L149,$B50,'Innsláttur - Gönguleiðir'!W$6:W$130)","v":0},{"$f":"SUMIF('Innsláttur - Gönguleiðir'!$L$6:$L149,$B50,'Innsláttur - Gönguleiðir'!X$6:X$130)","v":0},{"$f":"SUMIF('Innsláttur - Gönguleiðir'!$L$6:$L149,$B50,'Innsláttur - Gönguleiðir'!Y$6:Y$130)","v":0},{"$f":"SUMIF('Innsláttur - Gönguleiðir'!$L$6:$L149,$B50,'Innsláttur - Gönguleiðir'!Z$6:Z$130)","v":0},{"$f":"SUMIF('Innsláttur - Gönguleiðir'!$L$6:$L149,$B50,'Innsláttur - Gönguleiðir'!AA$6:AA$130)","v":0},{"$f":"SUMIF('Innsláttur - Gönguleiðir'!$L$6:$L149,$B50,'Innsláttur - Gönguleiðir'!AB$6:AB$130)","v":0}]
[null,"52.2 Styrktarlag",{"$f":"SUMIF('Innsláttur - Gönguleiðir'!$L$6:$L150,$B51,'Innsláttur - Gönguleiðir'!W$6:W$130)","v":0},{"$f":"SUMIF('Innsláttur - Gönguleiðir'!$L$6:$L150,$B51,'Innsláttur - Gönguleiðir'!X$6:X$130)","v":0},{"$f":"SUMIF('Innsláttur - Gönguleiðir'!$L$6:$L150,$B51,'Innsláttur - Gönguleiðir'!Y$6:Y$130)","v":0},{"$f":"SUMIF('Innsláttur - Gönguleiðir'!$L$6:$L150,$B51,'Innsláttur - Gönguleiðir'!Z$6:Z$130)","v":0},{"$f":"SUMIF('Innsláttur - Gönguleiðir'!$L$6:$L150,$B51,'Innsláttur - Gönguleiðir'!AA$6:AA$130)","v":0},{"$f":"SUMIF('Innsláttur - Gönguleiðir'!$L$6:$L150,$B51,'Innsláttur - Gönguleiðir'!AB$6:AB$130)","v":0}]
[null,"53.1 Óbundið burðarlag",{"$f":"SUMIF('Innsláttur - Gönguleiðir'!$L$6:$L151,$B52,'Innsláttur - Gönguleiðir'!W$6:W$130)","v":0},{"$f":"SUMIF('Innsláttur - Gönguleiðir'!$L$6:$L151,$B52,'Innsláttur - Gönguleiðir'!X$6:X$130)","v":0},{"$f":"SUMIF('Innsláttur - Gönguleiðir'!$L$6:$L151,$B52,'Innsláttur - Gönguleiðir'!Y$6:Y$130)","v":0},{"$f":"SUMIF('Innsláttur - Gönguleiðir'!$L$6:$L151,$B52,'Innsláttur - Gönguleiðir'!Z$6:Z$130)","v":0},{"$f":"SUMIF('Innsláttur - Gönguleiðir'!$L$6:$L151,$B52,'Innsláttur - Gönguleiðir'!AA$6:AA$130)","v":0},{"$f":"SUMIF('Innsláttur - Gönguleiðir'!$L$6:$L151,$B52,'Innsláttur - Gönguleiðir'!AB$6:AB$130)","v":0}]
[null,"63.42 Burðarlagsmalbik",{"$f":"SUMIF('Innsláttur - Gönguleiðir'!$L$6:$L152,$B53,'Innsláttur - Gönguleiðir'!W$6:W$130)","v":0},{"$f":"SUMIF('Innsláttur - Gönguleiðir'!$L$6:$L152,$B53,'Innsláttur - Gönguleiðir'!X$6:X$130)","v":0},{"$f":"SUMIF('Innsláttur - Gönguleiðir'!$L$6:$L152,$B53,'Innsláttur - Gönguleiðir'!Y$6:Y$130)","v":0},{"$f":"SUMIF('Innsláttur - Gönguleiðir'!$L$6:$L152,$B53,'Innsláttur - Gönguleiðir'!Z$6:Z$130)","v":0},{"$f":"SUMIF('Innsláttur - Gönguleiðir'!$L$6:$L152,$B53,'Innsláttur - Gönguleiðir'!AA$6:AA$130)","v":0},{"$f":"SUMIF('Innsláttur - Gönguleiðir'!$L$6:$L152,$B53,'Innsláttur - Gönguleiðir'!AB$6:AB$130)","v":0}]
[null,"63.43 Slitlagsmalbik",{"$f":"SUMIF('Innsláttur - Gönguleiðir'!$L$6:$L153,$B54,'Innsláttur - Gönguleiðir'!W$6:W$130)","v":0},{"$f":"SUMIF('Innsláttur - Gönguleiðir'!$L$6:$L153,$B54,'Innsláttur - Gönguleiðir'!X$6:X$130)","v":0},{"$f":"SUMIF('Innsláttur - Gönguleiðir'!$L$6:$L153,$B54,'Innsláttur - Gönguleiðir'!Y$6:Y$130)","v":0},{"$f":"SUMIF('Innsláttur - Gönguleiðir'!$L$6:$L153,$B54,'Innsláttur - Gönguleiðir'!Z$6:Z$130)","v":0},{"$f":"SUMIF('Innsláttur - Gönguleiðir'!$L$6:$L153,$B54,'Innsláttur - Gönguleiðir'!AA$6:AA$130)","v":0},{"$f":"SUMIF('Innsláttur - Gönguleiðir'!$L$6:$L153,$B54,'Innsláttur - Gönguleiðir'!AB$6:AB$130)","v":0}]
[null,"68.24 Steypt gangstétt",{"$f":"SUMIF('Innsláttur - Gönguleiðir'!$L$6:$L154,$B55,'Innsláttur - Gönguleiðir'!W$6:W$130)","v":0},{"$f":"SUMIF('Innsláttur - Gönguleiðir'!$L$6:$L154,$B55,'Innsláttur - Gönguleiðir'!X$6:X$130)","v":0},{"$f":"SUMIF('Innsláttur - Gönguleiðir'!$L$6:$L154,$B55,'Innsláttur - Gönguleiðir'!Y$6:Y$130)","v":0},{"$f":"SUMIF('Innsláttur - Gönguleiðir'!$L$6:$L154,$B55,'Innsláttur - Gönguleiðir'!Z$6:Z$130)","v":0},{"$f":"SUMIF('Innsláttur - Gönguleiðir'!$L$6:$L154,$B55,'Innsláttur - Gönguleiðir'!AA$6:AA$130)","v":0},{"$f":"SUMIF('Innsláttur - Gönguleiðir'!$L$6:$L154,$B55,'Innsláttur - Gönguleiðir'!AB$6:AB$130)","v":0}]
[null,"68.25 Gangstígar/eyjarhringtorg með hellum",{"$f":"SUMIF('Innsláttur - Gönguleiðir'!$L$6:$L155,$B56,'Innsláttur - Gönguleiðir'!W$6:W$130)","v":0},{"$f":"SUMIF('Innsláttur - Gönguleiðir'!$L$6:$L155,$B56,'Innsláttur - Gönguleiðir'!X$6:X$130)","v":0},{"$f":"SUMIF('Innsláttur - Gönguleiðir'!$L$6:$L155,$B56,'Innsláttur - Gönguleiðir'!Y$6:Y$130)","v":0},{"$f":"SUMIF('Innsláttur - Gönguleiðir'!$L$6:$L155,$B56,'Innsláttur - Gönguleiðir'!Z$6:Z$130)","v":0},{"$f":"SUMIF('Innsláttur - Gönguleiðir'!$L$6:$L155,$B56,'Innsláttur - Gönguleiðir'!AA$6:AA$130)","v":0},{"$f":"SUMIF('Innsláttur - Gönguleiðir'!$L$6:$L155,$B56,'Innsláttur - Gönguleiðir'!AB$6:AB$130)","v":0}]
[null,"75.1 Kantsteinar",{"$f":"SUMIF('Innsláttur - Gönguleiðir'!$L$6:$L156,$B57,'Innsláttur - Gönguleiðir'!W$6:W$130)","v":0},{"$f":"SUMIF('Innsláttur - Gönguleiðir'!$L$6:$L156,$B57,'Innsláttur - Gönguleiðir'!X$6:X$130)","v":0},{"$f":"SUMIF('Innsláttur - Gönguleiðir'!$L$6:$L156,$B57,'Innsláttur - Gönguleiðir'!Y$6:Y$130)","v":0},{"$f":"SUMIF('Innsláttur - Gönguleiðir'!$L$6:$L156,$B57,'Innsláttur - Gönguleiðir'!Z$6:Z$130)","v":0},{"$f":"SUMIF('Innsláttur - Gönguleiðir'!$L$6:$L156,$B57,'Innsláttur - Gönguleiðir'!AA$6:AA$130)","v":0},{"$f":"SUMIF('Innsláttur - Gönguleiðir'!$L$6:$L156,$B57,'Innsláttur - Gönguleiðir'!AB$6:AB$130)","v":0}]
[null,"75.2 Eyjar og hringtorg",{"$f":"SUMIF('Innsláttur - Gönguleiðir'!$L$6:$L157,$B58,'Innsláttur - Gönguleiðir'!W$6:W$130)","v":0},{"$f":"SUMIF('Innsláttur - Gönguleiðir'!$L$6:$L157,$B58,'Innsláttur - Gönguleiðir'!X$6:X$130)","v":0},{"$f":"SUMIF('Innsláttur - Gönguleiðir'!$L$6:$L157,$B58,'Innsláttur - Gönguleiðir'!Y$6:Y$130)","v":0},{"$f":"SUMIF('Innsláttur - Gönguleiðir'!$L$6:$L157,$B58,'Innsláttur - Gönguleiðir'!Z$6:Z$130)","v":0},{"$f":"SUMIF('Innsláttur - Gönguleiðir'!$L$6:$L157,$B58,'Innsláttur - Gönguleiðir'!AA$6:AA$130)","v":0},{"$f":"SUMIF('Innsláttur - Gönguleiðir'!$L$6:$L157,$B58,'Innsláttur - Gönguleiðir'!AB$6:AB$130)","v":0}]
[null,"75.6 Vegrið",{"$f":"SUMIF('Innsláttur - Gönguleiðir'!$L$6:$L158,$B59,'Innsláttur - Gönguleiðir'!W$6:W$130)","v":0},{"$f":"SUMIF('Innsláttur - Gönguleiðir'!$L$6:$L158,$B59,'Innsláttur - Gönguleiðir'!X$6:X$130)","v":0},{"$f":"SUMIF('Innsláttur - Gönguleiðir'!$L$6:$L158,$B59,'Innsláttur - Gönguleiðir'!Y$6:Y$130)","v":0},{"$f":"SUMIF('Innsláttur - Gönguleiðir'!$L$6:$L158,$B59,'Innsláttur - Gönguleiðir'!Z$6:Z$130)","v":0},{"$f":"SUMIF('Innsláttur - Gönguleiðir'!$L$6:$L158,$B59,'Innsláttur - Gönguleiðir'!AA$6:AA$130)","v":0},{"$f":"SUMIF('Innsláttur - Gönguleiðir'!$L$6:$L158,$B59,'Innsláttur - Gönguleiðir'!AB$6:AB$130)","v":0}]
[null,"76.45 Ljósastuarar",{"$f":"SUMIF('Innsláttur - Gönguleiðir'!$L$6:$L159,$B60,'Innsláttur - Gönguleiðir'!W$6:W$130)","v":0},{"$f":"SUMIF('Innsláttur - Gönguleiðir'!$L$6:$L159,$B60,'Innsláttur - Gönguleiðir'!X$6:X$130)","v":0},{"$f":"SUMIF('Innsláttur - Gönguleiðir'!$L$6:$L159,$B60,'Innsláttur - Gönguleiðir'!Y$6:Y$130)","v":0},{"$f":"SUMIF('Innsláttur - Gönguleiðir'!$L$6:$L159,$B60,'Innsláttur - Gönguleiðir'!Z$6:Z$130)","v":0},{"$f":"SUMIF('Innsláttur - Gönguleiðir'!$L$6:$L159,$B60,'Innsláttur - Gönguleiðir'!AA$6:AA$130)","v":0},{"$f":"SUMIF('Innsláttur - Gönguleiðir'!$L$6:$L159,$B60,'Innsláttur - Gönguleiðir'!AB$6:AB$130)","v":0}]
[null,"75.62 Vegrið á brú",{"$f":"SUMIF('Innsláttur - Gönguleiðir'!$L$6:$L160,$B61,'Innsláttur - Gönguleiðir'!W$6:W$130)","v":0},{"$f":"SUMIF('Innsláttur - Gönguleiðir'!$L$6:$L160,$B61,'Innsláttur - Gönguleiðir'!X$6:X$130)","v":0},{"$f":"SUMIF('Innsláttur - Gönguleiðir'!$L$6:$L160,$B61,'Innsláttur - Gönguleiðir'!Y$6:Y$130)","v":0},{"$f":"SUMIF('Innsláttur - Gönguleiðir'!$L$6:$L160,$B61,'Innsláttur - Gönguleiðir'!Z$6:Z$130)","v":0},{"$f":"SUMIF('Innsláttur - Gönguleiðir'!$L$6:$L160,$B61,'Innsláttur - Gönguleiðir'!AA$6:AA$130)","v":0},{"$f":"SUMIF('Innsláttur - Gönguleiðir'!$L$6:$L160,$B61,'Innsláttur - Gönguleiðir'!AB$6:AB$130)","v":0}]
[null,"75.7 Handrið",{"$f":"SUMIF('Innsláttur - Gönguleiðir'!$L$6:$L161,$B62,'Innsláttur - Gönguleiðir'!W$6:W$130)","v":0},{"$f":"SUMIF('Innsláttur - Gönguleiðir'!$L$6:$L161,$B62,'Innsláttur - Gönguleiðir'!X$6:X$130)","v":0},{"$f":"SUMIF('Innsláttur - Gönguleiðir'!$L$6:$L161,$B62,'Innsláttur - Gönguleiðir'!Y$6:Y$130)","v":0},{"$f":"SUMIF('Innsláttur - Gönguleiðir'!$L$6:$L161,$B62,'Innsláttur - Gönguleiðir'!Z$6:Z$130)","v":0},{"$f":"SUMIF('Innsláttur - Gönguleiðir'!$L$6:$L161,$B62,'Innsláttur - Gönguleiðir'!AA$6:AA$130)","v":0},{"$f":"SUMIF('Innsláttur - Gönguleiðir'!$L$6:$L161,$B62,'Innsláttur - Gönguleiðir'!AB$6:AB$130)","v":0}]
[null,"Samtals",{"$f":"SUM(C34:C62)","v":0},0,0,0,0,0]

{"sheet":"Niðurstöður - Heildarframkvæmd","index":11,"n_rows":286,"n_cols":26,"rows_kept":286,"cut":false,"hidden":false,"merged":[[17,13,17,15],[24,11,24,15],[28,21,28,25],[35,1,35,7],[37,2,37,7],[19,11,19,12],[20,11,20,12],[19,14,19,16],[20,14,20,16],[17,1,17,7],[19,2,19,7],[3,1,3,7],[5,2,5,7],[9,11,9,16],[10,11,10,16],[3,11,3,16],[4,11,4,16],[5,11,5,16],[6,11,6,16],[7,11,7,16],[12,13,12,15],[13,13,13,15],[14,13,14,15],[15,13,15,15],[2,21,2,23]]}
[]
[null,"Niðurstöður - Heildarframkvæmd",null,null,null,null,null,null,null,null,"Skýrsla - Heildarframkvæmd"]
[null,null,null,null,null,null,null,null,null,null,null,null,null,null,null,null,null,null,null,null,null,"kg CO2-ígildi"]
[null,"Niðurstöður kolefnisútreikninga, deilt niður á yfirverkþætti og vistferilsfasa",null,null,null,null,null,null,null,null,"Nafn verkefnis",{"$f":"IF(ISBLANK(Forsíða!D5),\"\",Forsíða!D5)","v":""},null,null,null,null,null,null,null,null,null,"Heild","Per km","per m2"]
[null,null,null,null,null,null,null,null,null,null,"Staðsetning",{"$f":"IF(ISBLANK(Forsíða!D5),\"\",Forsíða!D5)","v":""},null,null,null,null,null,null,null,null,"A1-A3",{"$f":"L34","v":0},{"$f":"V5/($L$18/1000)","v":{"$error":"#DIV/0!"}},{"$f":"V5/$Q$18","v":{"$error":"#DIV/0!"}}]
[null,null,"kg CO2-ígildi",null,null,null,null,null,null,null,"Dagsetning greiningar",{"$f":"IF(ISBLANK(Forsíða!D6),\"\",Forsíða!D6)","v":""},null,null,null,null,null,null,null,null,"A4",{"$f":"M34","v":0},{"$f":"V6/($L$18/1000)","v":{"$error":"#DIV/0!"}},{"$f":"V6/$Q$18","v":{"$error":"#DIV/0!"}}]
[null,null,"A1-A3","A4","A5","A1-A5","B4","A1-A5 + B4",null,null,"Greiningartími (ár)",{"$f":"IF(ISBLANK(Forsíða!D7),\"\",Forsíða!D7)","v":"dd.mm.yyyy"},null,null,null,null,null,null,null,null,"A5",{"$f":"N34","v":0},{"$error":"#DIV/0!"},{"$f":"V7/$Q$18","v":{"$error":"#DIV/0!"}}]
[null,"Skeringar og undirbygging",{"$f":"'Niðurstöður - Vegir'!C8+'Niðurstöður - Brýr'!C8+'Niðurstöður - Jarðgöng'!C8+'Niðurstöður - Gönguleiðir'!C8","v":0},{"$f":"'Niðurstöður - Vegir'!D8+'Niðurstöður - Brýr'!D8+'Niðurstöður - Jarðgöng'!D8+'Niðurstöður - Gönguleiðir'!D8","v":0},{"$f":"'Niðurstöður - Vegir'!E8+'Niðurstöður - Brýr'!E8+'Niðurstöður - Jarðgöng'!E8+'Niðurstöður - Gönguleiðir'!E8","v":0},{"$f":"'Niðurstöður - Vegir'!F8+'Niðurstöður - Brýr'!F8+'Niðurstöður - Jarðgöng'!F8+'Niðurstöður - Gönguleiðir'!F8","v":0},{"$f":"'Niðurstöður - Vegir'!G8+'Niðurstöður - Brýr'!G8+'Niðurstöður - Jarðgöng'!G8+'Niðurstöður - Gönguleiðir'!G8","v":0},{"$f":"'Niðurstöður - Vegir'!H8+'Niðurstöður - Brýr'!H8+'Niðurstöður - Jarðgöng'!H8+'Niðurstöður - Gönguleiðir'!H8","v":0},null,null,"Unnið af",{"$f":"IF(ISBLANK(Forsíða!D8),\"\",Forsíða!D8)","v":60},null,null,null,null,null,null,null,null,"B4",{"$f":"O34","v":0},{"$error":"#DIV/0!"},{"$f":"V8/$Q$18","v":{"$error":"#DIV/0!"}}]
[null,"Ræsi og veitur",{"$f":"'Niðurstöður - Vegir'!C9+'Niðurstöður - Brýr'!C9+'Niðurstöður - Jarðgöng'!C9+'Niðurstöður - Gönguleiðir'!C9","v":0},{"$f":"'Niðurstöður - Vegir'!D9+'Niðurstöður - Brýr'!D9+'Niðurstöður - Jarðgöng'!D9+'Niðurstöður - Gönguleiðir'!D9","v":0},{"$f":"'Niðurstöður - Vegir'!E9+'Niðurstöður - Brýr'!E9+'Niðurstöður - Jarðgöng'!E9+'Niðurstöður - Gönguleiðir'!E9","v":0},{"$f":"'Niðurstöður - Vegir'!F9+'Niðurstöður - Brýr'!F9+'Niðurstöður - Jarðgöng'!F9+'Niðurstöður - Gönguleiðir'!F9","v":0},{"$f":"'Niðurstöður - Vegir'!G9+'Niðurstöður - Brýr'!G9+'Niðurstöður - Jarðgöng'!G9+'Niðurstöður - Gönguleiðir'!G9","v":0},{"$f":"'Niðurstöður - Vegir'!H9+'Niðurstöður - Brýr'!H9+'Niðurstöður - Jarðgöng'!H9+'Niðurstöður - Gönguleiðir'!H9","v":0},null,null,null,null,null,null,null,null,null,null,null,null,"Samtals",{"$f":"SUM(V5:V8)","v":0},{"$f":"SUM(W5:W8)","v":{"$error":"#DIV/0!"}},{"$error":"#DIV/0!"}]
[null,"Styrktar- og burðarlög",{"$f":"'Niðurstöður - Vegir'!C10+'Niðurstöður - Jarðgöng'!C10+'Niðurstöður - Gönguleiðir'!C10","v":0},{"$f":"'Niðurstöður - Vegir'!D10+'Niðurstöður - Jarðgöng'!D10+'Niðurstöður - Gönguleiðir'!D10","v":0},{"$f":"'Niðurstöður - Vegir'!E10+'Niðurstöður - Jarðgöng'!E10+'Niðurstöður - Gönguleiðir'!E10","v":0},{"$f":"'Niðurstöður - Vegir'!F10+'Niðurstöður - Jarðgöng'!F10+'Niðurstöður - Gönguleiðir'!F10","v":0},{"$f":"'Niðurstöður - Vegir'!G10+'Niðurstöður - Jarðgöng'!G10+'Niðurstöður - Gönguleiðir'!G10","v":0},{"$f":"'Niðurstöður - Vegir'!H10+'Niðurstöður - Jarðgöng'!H10+'Niðurstöður - Gönguleiðir'!H10","v":0},null,null,"Árdagsumferð (ÁDU)",{"$f":"IF(ISBLANK(Forsíða!D11),\"\",Forsíða!D11)","v":""}]
[null,"Slitlög",{"$f":"'Niðurstöður - Vegir'!C11+'Niðurstöður - Brýr'!C10+'Niðurstöður - Jarðgöng'!C11+'Niðurstöður - Gönguleiðir'!C11","v":0},{"$f":"'Niðurstöður - Vegir'!D11+'Niðurstöður - Brýr'!D10+'Niðurstöður - Jarðgöng'!D11+'Niðurstöður - Gönguleiðir'!D11","v":0},{"$f":"'Niðurstöður - Vegir'!E11+'Niðurstöður - Brýr'!E10+'Niðurstöður - Jarðgöng'!E11+'Niðurstöður - Gönguleiðir'!E11","v":0},{"$f":"'Niðurstöður - Vegir'!F11+'Niðurstöður - Brýr'!F10+'Niðurstöður - Jarðgöng'!F11+'Niðurstöður - Gönguleiðir'!F11","v":0},{"$f":"'Niðurstöður - Vegir'!G11+'Niðurstöður - Brýr'!G10+'Niðurstöður - Jarðgöng'!G11+'Niðurstöður - Gönguleiðir'!G11","v":0},{"$f":"'Niðurstöður - Vegir'!H11+'Niðurstöður - Brýr'!H10+'Niðurstöður - Jarðgöng'!H11+'Niðurstöður - Gönguleiðir'!H11","v":0},null,null,"Framkvæmdarstig",{"$f":"IF(ISBLANK(Forsíða!D12),\"\",Forsíða!D12)","v":"Veldu framkvæmdarstig"}]
[null,"Öryggisbúnaður og frágangur",{"$f":"'Niðurstöður - Vegir'!C12+'Niðurstöður - Brýr'!C11+'Niðurstöður - Jarðgöng'!C12+'Niðurstöður - Gönguleiðir'!C12","v":0},{"$f":"'Niðurstöður - Vegir'!D12+'Niðurstöður - Brýr'!D11+'Niðurstöður - Jarðgöng'!D12+'Niðurstöður - Gönguleiðir'!D12","v":0},{"$f":"'Niðurstöður - Vegir'!E12+'Niðurstöður - Brýr'!E11+'Niðurstöður - Jarðgöng'!E12+'Niðurstöður - Gönguleiðir'!E12","v":0},{"$f":"'Niðurstöður - Vegir'!F12+'Niðurstöður - Brýr'!F11+'Niðurstöður - Jarðgöng'!F12+'Niðurstöður - Gönguleiðir'!F12","v":0},{"$f":"'Niðurstöður - Vegir'!G12+'Niðurstöður - Brýr'!G11+'Niðurstöður - Jarðgöng'!G12+'Niðurstöður - Gönguleiðir'!G12","v":0},{"$f":"'Niðurstöður - Vegir'!H12+'Niðurstöður - Brýr'!H11+'Niðurstöður - Jarðgöng'!H12+'Niðurstöður - Gönguleiðir'!H12","v":0}]
[null,"Brýr og steypt mannvirki",{"$f":"'Niðurstöður - Brýr'!C12+'Niðurstöður - Jarðgöng'!C13","v":0},{"$f":"'Niðurstöður - Brýr'!D12+'Niðurstöður - Jarðgöng'!D13","v":0},{"$f":"'Niðurstöður - Brýr'!E12+'Niðurstöður - Jarðgöng'!E13","v":0},{"$f":"'Niðurstöður - Brýr'!F12+'Niðurstöður - Jarðgöng'!F13","v":0},{"$f":"'Niðurstöður - Brýr'!G12+'Niðurstöður - Jarðgöng'!G13","v":0},{"$f":"'Niðurstöður - Brýr'!H12+'Niðurstöður - Jarðgöng'!H13","v":0},null,null,"Heildarlengd vegs [m]",{"$f":"Forsíða!D14","v":0},null,"Heildarflatarmál vegs [m2]",null,null,{"$f":"Forsíða!G14","v":0}]
[null,"Jarðgöng",{"$f":"'Niðurstöður - Jarðgöng'!C14","v":0},{"$f":"'Niðurstöður - Jarðgöng'!D14","v":0},{"$f":"'Niðurstöður - Jarðgöng'!E14","v":0},{"$f":"'Niðurstöður - Jarðgöng'!F14","v":0},{"$f":"'Niðurstöður - Jarðgöng'!G14","v":0},{"$f":"'Niðurstöður - Jarðgöng'!H14","v":0},null,null,"Heildarlengd brúa [m]",{"$f":"Forsíða!D15","v":0},null,"Heildarflatarmál brúa [m2]",null,null,{"$f":"Forsíða!G15","v":0}]
[null,"Samtals",{"$f":"SUM(C8:C14)","v":0},0,0,0,0,0,null,null,"Heildarlengd jarðgangna [m]",{"$f":"Forsíða!D16","v":0},null,"Heildarflatarmál jarðgangna [m2]",null,null,{"$f":"Forsíða!G16","v":0}]
[null,null,null,null,null,null,null,null,null,null,"Heildarlengd gönguleiða [m]",{"$f":"Forsíða!D17","v":0},null,"Heildarflatarmál gönguleiða [m2]",null,null,{"$f":"Forsíða!G17","v":0}]
[]
[null,"Niðurstöður kolefnisútreikninga, skipt niður á efnisflokka og vistferilsfasa",null,null,null,null,null,null,null,null,"Heildarlengd framkvæmdar [m]",{"$f":"Forsíða!D19","v":0},null,"Heildarflatarmál framkvæmdar [m2]",null,null,{"$f":"Forsíða!G19","v":0}]
[]
[null,null,"kg CO2-ígildi",null,null,null,null,null,null,null,"Útreiknað heildarkolefnisspor",{"$f":"MROUND(V9/1000,10)&\" tonn CO2-ígildi\"","v":"0 tonn CO2-ígildi"},null,"Óvissubil",{"$f":"IF(L11=Sheet2!P7,\"Engin áætluð óvissa\",MROUND(V9*_xlfn.XLOOKUP(L11,Sheet2!P3:P7,Sheet2!Q3:Q7)/1000,10)&\" - \"&MROUND(V9*_xlfn.XLOOKUP(L11,Sheet2!P3:P7,Sheet2!R3:R7)/1000,10)&\" tonn CO2-ígildi\")","v":{"$error":"#N/A"}}]
[null,null,"A1-A3","A4","A5","A1-A5","B4","A1-A5 + B4",null,null,"Útreiknað kolefnisspor á m2",{"$f":"MROUND(X9,1)&\" kg CO2-ígildi/m2\"","v":{"$error":"#DIV/0!"}},null,"Óvissubil",{"$f":"IF(L11=Sheet2!P7,\"Engin áætluð óvissa\",MROUND(V9*_xlfn.XLOOKUP(L11,Sheet2!P3:P7,Sheet2!Q3:Q7)/Q18,1)&\" - \"&MROUND(V9*_xlfn.XLOOKUP(L11,Sheet2!P3:P7,Sheet2!R3:R7)/Q18,1)&\" kg CO2-ígildi/m2\")","v":{"$error":"#N/A"}}]
[null,"Jarðvinna",{"$f":"SUMIF($L$136:$L$170,$B22,M$136:M$170)","v":0},{"$f":"SUMIF($L$136:$L$170,$B22,N$136:N$170)","v":0},{"$f":"SUMIF($L$136:$L$170,$B22,O$136:O$170)","v":0},{"$f":"SUMIF($L$136:$L$170,$B22,P$136:P$170)","v":0},{"$f":"SUMIF($L$136:$L$170,$B22,Q$136:Q$170)","v":0},{"$f":"SUMIF($L$136:$L$170,$B22,R$136:R$170)","v":0}]
[null,"Plast",0,0,0,0,0,0]
[null,"Stál",0,0,0,0,0,0]
[null,"Steypa",0,0,0,0,0,0,null,null,null,"kg CO2-ígildi"]
[null,"Rafstrengur",0,0,0,0,0,0,null,null,null,"A1-A3","A4","A5","B4","Samtals"]
[null,"Klæðing",0,0,0,0,0,0,null,null,"Skeringar og undirbygging",{"$f":"C8","v":0},0,0,{"$f":"G8","v":0},{"$f":"SUM(L27:O27)","v":0}]
[null,"Malbik",0,0,0,0,0,0,null,null,"Ræsi og veitur",0,0,0,0,{"$f":"SUM(L28:O28)","v":0}]
[null,"Timbur",0,0,0,0,0,0,null,null,"Styrktar- og burðarlög",0,0,0,0,0,null,null,null,null,null,"kg CO2-ígildi"]
[null,"Annað",0,0,0,0,0,0,null,null,"Slitlög",0,0,0,0,0,null,null,null,null,null,"A1-A3","A4","A5","B4","Samtals"]
[null,"Gúmmí",0,0,0,0,0,0,null,null,"Öryggisbúnaður og frágangur",0,0,0,0,0,null,null,null,null,"Jarðvinna",{"$f":"C22","v":0},{"$f":"D22","v":0},{"$f":"E22","v":0},{"$f":"G22","v":0},{"$f":"SUM(V31:Y31)","v":0}]
[null,"Dísilolíunotkun á verkstað",0,0,0,0,0,0,null,null,"Brýr og steypt mannvirki",0,0,0,0,0,null,null,null,null,"Plast",0,0,0,0,0]
[null,"Samtals",{"$f":"SUM(C22:C32)","v":0},0,0,0,0,0,null,null,"Jarðgöng",0,0,0,0,0,null,null,null,null,"Stál",0,0,0,0,0]
[null,null,null,null,null,null,null,null,null,null,"Samtals",{"$f":"SUM(L27:L33)","v":0},{"$f":"SUM(M27:M33)","v":0},0,0,0,null,null,null,null,"Steypa",0,0,0,0,0]
[null,null,null,null,null,null,null,null,null,null,null,null,null,null,null,null,null,null,null,null,"Rafstrengur",0,0,0,0,0]
[null,"Niðurstöður kolefnisútreikninga, deilt niður á undirverkþætti og vistferilsfasa",null,null,null,null,null,null,null,null,null,null,null,null,null,null,null,null,null,null,"Klæðing",0,0,0,0,0]
[null,null,null,null,null,null,null,null,null,null,null,null,null,null,null,null,null,null,null,null,"Malbik",0,0,0,0,0]
[null,null,"kg CO2-ígildi",null,null,null,null,null,null,null,null,null,null,null,null,null,null,null,null,null,"Timbur",0,0,0,0,0]
[null,null,"A1-A3","A4","A5","A1-A5","B4","A1-A5 + B4",null,null,null,null,null,null,null,null,null,null,null,null,"Annað",0,0,0,0,0]
[null,"32.1 Bergskeringar í vegstæði",{"$f":"SUMIF($B$132:$B$306,$B40,C$132:C$306)","v":0},0,0,0,0,0,null,null,null,null,null,null,null,null,null,null,null,null,"Gúmmí",0,0,0,0,0]
[null,"32.2 Bergskeringar í námu",0,0,0,0,0,0,null,null,null,null,null,null,null,null,null,null,null,null,"Dísilolíunotkun á verkstað",0,0,0,0,0]
[null,"33.1 Fyllingarefni úr skeringum",0,0,0,0,0,0,null,null,null,null,null,null,null,null,null,null,null,null,"Samtals",{"$f":"SUM(V31:V41)","v":0},{"$f":"SUM(W31:W41)","v":0},{"$f":"SUM(X31:X41)","v":0},{"$f":"SUM(Y31:Y41)","v":0},{"$f":"SUM(V42:Y42)","v":0}]
[null,"33.2 Fyllingarefni úr námu",0,0,0,0,0,0]
[null,"34.1 Fláafleygar, efni úr skeringum",0,0,0,0,0,0]
[null,"34.8 Ónothæfu efni jafnað á losunarstað",0,0,0,0,0,0]
[null,"36.2 Grjótvörn",0,0,0,0,0,0]
[null,"45.71 Plaströr, vatnsveita",0,0,0,0,0,0]
[null,"42.3 Plaströr, fráveita",0,0,0,0,0,0]
[null,"45.72 Hitaveiturör",0,0,0,0,0,0]
[null,"42.4 Stálrör í ræsi",{"$f":"SUMIF($B$132:$B$306,$B50,C$132:C$306)","v":0},0,0,0,0,0]
[null,"45.4 Steypt ofanvatnsræsi",0,0,0,0,0,0]
[null,"45.5 Brunnar",0,0,0,0,0,0]
[null,"45.6 Niðurföll / sandfang",0,0,0,0,0,0]
[null,"45.68 Grjótsvelgur",0,0,0,0,0,0]
[null,"45.1 + 45.8 Gröftur lagnaskurða og fylling í skurði",0,0,0,0,0,0]
[null,"Rafstrengir",0,0,0,0,0,0]
[null,"52.2 Styrktarlag",0,0,0,0,0,0]
[null,"53.1 Óbundið burðarlag",0,0,0,0,0,0]
[null,"62.1 Klæðing, nýlögn",0,0,0,0,0,0]
[null,"63.42 Burðarlagsmalbik",{"$f":"SUMIF($B$132:$B$306,$B60,C$132:C$306)","v":0},0,0,0,0,0]
[null,"63.43 Slitlagsmalbik",0,0,0,0,0,0]
[null,"68.24 Steypt gangstétt",0,0,0,0,0,0]
[null,"68.25 Gangstígar/eyjarhringtorg með hellum",0,0,0,0,0,0]
[null,"75.1 Kantsteinar",0,0,0,0,0,0]
[null,"75.2 Eyjar og hringtorg",0,0,0,0,0,0]
[null,"75.6 Vegrið",0,0,0,0,0,0]
[null,"76.45 Ljósastuarar",0,0,0,0,0,0]
[null,"75.62 Vegrið á brú",0,0,0,0,0,0]
[null,"75.7 Handrið",0,0,0,0,0,0]
[null,"81.31 Fylling við steypt mannvirki",{"$f":"SUMIF($B$132:$B$306,$B70,C$132:C$306)","v":0},0,0,0,0,0]
[null,"83.11 Bergboltar",0,0,0,0,0,0]
[null,"83.212 Steyptir staurar",0,0,0,0,0,0]
[null,"83.222 Tréstaurar",0,0,0,0,0,0]
[null,"83.232 Stálstaurar",0,0,0,0,0,0]
[null,"83.6 Stálþil",0,0,0,0,0,0]
[null,"84.2 Mót",0,0,0,0,0,0]
[null,"84.31 Slakbent járnalögn",0,0,0,0,0,0]
[null,"84.36 Eftirspennt járnalögn",0,0,0,0,0,0]
[null,"84.4 Steypa",0,0,0,0,0,0]
[null,"84.57 Vatnsvarnalag undir malbiki",{"$f":"SUMIF($B$132:$B$306,$B80,C$132:C$306)","v":0},0,0,0,0,0]
[null,"85.1 Stálvirki",0,0,0,0,0,0]
[null,"86.1 Legur",0,0,0,0,0,0]
[null,"86.4 Þensluraufar",0,0,0,0,0,0]
[null,"22.51 Gröftur í göngum",0,0,0,0,0,0]
[null,"23.2 Borun könnunar og bergþéttingarhola",0,0,0,0,0,0]
[null,"23.6 Bergþétting með sementsefju",0,0,0,0,0,0]
[null,"25.2 Bergboltar",0,0,0,0,0,0]
[null,"25.4 Sprautusteypa",0,0,0,0,0,0]
[null,"25.62 Járnalögn",0,0,0,0,0,0]
[null,"26.3 Dúkur undir sprautusteypu",0,0,0,0,0,0]
[null,"26.1 Einangrunarklæðing undir sprautusteypu",0,0,0,0,0,0]
[null,"Samtals",{"$f":"SUM(C40:C91)","v":0},0,0,0,0,0]
[]
[]
[]
[]
[]
[]
[]
[]
[]
[]
[]
[]
[]
[]
[]
[]
[]
[]
[]
[]
[]
[]
[]
[]
[]
[]
[]
[]
[]
[]
[]
[]
[]
[]
[]
[]
[]
[]
[]
[null,{"$f":"'Niðurstöður - Vegir'!B35","v":"32.1 Bergskeringar í vegstæði"},{"$f":"'Niðurstöður - Vegir'!C35","v":0},{"$f":"'Niðurstöður - Vegir'!D35","v":0},{"$f":"'Niðurstöður - Vegir'!E35","v":0},{"$f":"'Niðurstöður - Vegir'!F35","v":0},{"$f":"'Niðurstöður - Vegir'!G35","v":0},{"$f":"'Niðurstöður - Vegir'!H35","v":0}]
[null,{"$f":"'Niðurstöður - Vegir'!B36","v":"32.2 Bergskeringar í námu"},{"$f":"'Niðurstöður - Vegir'!C36","v":0},{"$f":"'Niðurstöður - Vegir'!D36","v":0},{"$f":"'Niðurstöður - Vegir'!E36","v":0},{"$f":"'Niðurstöður - Vegir'!F36","v":0},{"$f":"'Niðurstöður - Vegir'!G36","v":0},{"$f":"'Niðurstöður - Vegir'!H36","v":0}]
[null,{"$f":"'Niðurstöður - Vegir'!B37","v":"33.1 Fyllingarefni úr skeringum"},{"$f":"'Niðurstöður - Vegir'!C37","v":0},{"$f":"'Niðurstöður - Vegir'!D37","v":0},{"$f":"'Niðurstöður - Vegir'!E37","v":0},{"$f":"'Niðurstöður - Vegir'!F37","v":0},{"$f":"'Niðurstöður - Vegir'!G37","v":0},{"$f":"'Niðurstöður - Vegir'!H37","v":0}]
[null,{"$f":"'Niðurstöður - Vegir'!B38","v":"33.2 Fyllingarefni úr námu"},{"$f":"'Niðurstöður - Vegir'!C38","v":0},{"$f":"'Niðurstöður - Vegir'!D38","v":0},{"$f":"'Niðurstöður - Vegir'!E38","v":0},{"$f":"'Niðurstöður - Vegir'!F38","v":0},{"$f":"'Niðurstöður - Vegir'!G38","v":0},{"$f":"'Niðurstöður - Vegir'!H38","v":0}]
[null,{"$f":"'Niðurstöður - Vegir'!B39","v":"34.1 Fláafleygar, efni úr skeringum"},{"$f":"'Niðurstöður - Vegir'!C39","v":0},{"$f":"'Niðurstöður - Vegir'!D39","v":0},{"$f":"'Niðurstöður - Vegir'!E39","v":0},{"$f":"'Niðurstöður - Vegir'!F39","v":0},{"$f":"'Niðurstöður - Vegir'!G39","v":0},{"$f":"'Niðurstöður - Vegir'!H39","v":0},null,null,null,{"$f":"'Niðurstöður - Vegir'!B20","v":"Jarðvinna"},{"$f":"'Niðurstöður - Vegir'!C20","v":0},{"$f":"'Niðurstöður - Vegir'!D20","v":0},{"$f":"'Niðurstöður - Vegir'!E20","v":0},{"$f":"'Niðurstöður - Vegir'!F20","v":0},{"$f":"'Niðurstöður - Vegir'!G20","v":0},{"$f":"'Niðurstöður - Vegir'!H20","v":0}]
[null,{"$f":"'Niðurstöður - Vegir'!B40","v":"34.8 Ónothæfu efni jafnað á losunarstað"},{"$f":"'Niðurstöður - Vegir'!C40","v":0},{"$f":"'Niðurstöður - Vegir'!D40","v":0},{"$f":"'Niðurstöður - Vegir'!E40","v":0},{"$f":"'Niðurstöður - Vegir'!F40","v":0},{"$f":"'Niðurstöður - Vegir'!G40","v":0},{"$f":"'Niðurstöður - Vegir'!H40","v":0},null,null,null,{"$f":"'Niðurstöður - Vegir'!B21","v":"Plast"},{"$f":"'Niðurstöður - Vegir'!C21","v":0},{"$f":"'Niðurstöður - Vegir'!D21","v":0},{"$f":"'Niðurstöður - Vegir'!E21","v":0},{"$f":"'Niðurstöður - Vegir'!F21","v":0},{"$f":"'Niðurstöður - Vegir'!G21","v":0},{"$f":"'Niðurstöður - Vegir'!H21","v":0}]
[null,{"$f":"'Niðurstöður - Vegir'!B41","v":"36.2 Grjótvörn"},{"$f":"'Niðurstöður - Vegir'!C41","v":0},{"$f":"'Niðurstöður - Vegir'!D41","v":0},{"$f":"'Niðurstöður - Vegir'!E41","v":0},{"$f":"'Niðurstöður - Vegir'!F41","v":0},{"$f":"'Niðurstöður - Vegir'!G41","v":0},{"$f":"'Niðurstöður - Vegir'!H41","v":0},null,null,null,{"$f":"'Niðurstöður - Vegir'!B22","v":"Stál"},{"$f":"'Niðurstöður - Vegir'!C22","v":0},{"$f":"'Niðurstöður - Vegir'!D22","v":0},{"$f":"'Niðurstöður - Vegir'!E22","v":0},{"$f":"'Niðurstöður - Vegir'!F22","v":0},{"$f":"'Niðurstöður - Vegir'!G22","v":0},{"$f":"'Niðurstöður - Vegir'!H22","v":0}]
[null,{"$f":"'Niðurstöður - Vegir'!B42","v":"45.71 Plaströr, vatnsveita"},{"$f":"'Niðurstöður - Vegir'!C42","v":0},{"$f":"'Niðurstöður - Vegir'!D42","v":0},{"$f":"'Niðurstöður - Vegir'!E42","v":0},{"$f":"'Niðurstöður - Vegir'!F42","v":0},{"$f":"'Niðurstöður - Vegir'!G42","v":0},{"$f":"'Niðurstöður - Vegir'!H42","v":0},null,null,null,{"$f":"'Niðurstöður - Vegir'!B23","v":"Steypa"},{"$f":"'Niðurstöður - Vegir'!C23","v":0},{"$f":"'Niðurstöður - Vegir'!D23","v":0},{"$f":"'Niðurstöður - Vegir'!E23","v":0},{"$f":"'Niðurstöður - Vegir'!F23","v":0},{"$f":"'Niðurstöður - Vegir'!G23","v":0},{"$f":"'Niðurstöður - Vegir'!H23","v":0}]
[null,{"$f":"'Niðurstöður - Vegir'!B43","v":"42.3 Plaströr, fráveita"},{"$f":"'Niðurstöður - Vegir'!C43","v":0},{"$f":"'Niðurstöður - Vegir'!D43","v":0},{"$f":"'Niðurstöður - Vegir'!E43","v":0},{"$f":"'Niðurstöður - Vegir'!F43","v":0},{"$f":"'Niðurstöður - Vegir'!G43","v":0},{"$f":"'Niðurstöður - Vegir'!H43","v":0},null,null,null,{"$f":"'Niðurstöður - Vegir'!B24","v":"Rafstrengur"},{"$f":"'Niðurstöður - Vegir'!C24","v":0},{"$f":"'Niðurstöður - Vegir'!D24","v":0},{"$f":"'Niðurstöður - Vegir'!E24","v":0},{"$f":"'Niðurstöður - Vegir'!F24","v":0},{"$f":"'Niðurstöður - Vegir'!G24","v":0},{"$f":"'Niðurstöður - Vegir'!H24","v":0}]
[null,{"$f":"'Niðurstöður - Vegir'!B44","v":"45.72 Hitaveiturör"},{"$f":"'Niðurstöður - Vegir'!C44","v":0},{"$f":"'Niðurstöður - Vegir'!D44","v":0},{"$f":"'Niðurstöður - Vegir'!E44","v":0},{"$f":"'Niðurstöður - Vegir'!F44","v":0},{"$f":"'Niðurstöður - Vegir'!G44","v":0},{"$f":"'Niðurstöður - Vegir'!H44","v":0},null,null,null,{"$f":"'Niðurstöður - Vegir'!B25","v":"Klæðing"},{"$f":"'Niðurstöður - Vegir'!C25","v":0},{"$f":"'Niðurstöður - Vegir'!D25","v":0},{"$f":"'Niðurstöður - Vegir'!E25","v":0},{"$f":"'Niðurstöður - Vegir'!F25","v":0},{"$f":"'Niðurstöður - Vegir'!G25","v":0},{"$f":"'Niðurstöður - Vegir'!H25","v":0}]
[null,{"$f":"'Niðurstöður - Vegir'!B45","v":"42.4 Stálrör í ræsi"},{"$f":"'Niðurstöður - Vegir'!C45","v":0},{"$f":"'Niðurstöður - Vegir'!D45","v":0},{"$f":"'Niðurstöður - Vegir'!E45","v":0},{"$f":"'Niðurstöður - Vegir'!F45","v":0},{"$f":"'Niðurstöður - Vegir'!G45","v":0},{"$f":"'Niðurstöður - Vegir'!H45","v":0},null,null,null,{"$f":"'Niðurstöður - Vegir'!B26","v":"Malbik"},{"$f":"'Niðurstöður - Vegir'!C26","v":0},{"$f":"'Niðurstöður - Vegir'!D26","v":0},{"$f":"'Niðurstöður - Vegir'!E26","v":0},{"$f":"'Niðurstöður - Vegir'!F26","v":0},{"$f":"'Niðurstöður - Vegir'!G26","v":0},{"$f":"'Niðurstöður - Vegir'!H26","v":0}]
[null,{"$f":"'Niðurstöður - Vegir'!B46","v":"45.4 Steypt ofanvatnsræsi"},{"$f":"'Niðurstöður - Vegir'!C46","v":0},{"$f":"'Niðurstöður - Vegir'!D46","v":0},{"$f":"'Niðurstöður - Vegir'!E46","v":0},{"$f":"'Niðurstöður - Vegir'!F46","v":0},{"$f":"'Niðurstöður - Vegir'!G46","v":0},{"$f":"'Niðurstöður - Vegir'!H46","v":0},null,null,null,{"$f":"'Niðurstöður - Vegir'!B27","v":"Dísilolíunotkun á verkstað"},{"$f":"'Niðurstöður - Vegir'!C27","v":0},{"$f":"'Niðurstöður - Vegir'!D27","v":0},{"$f":"'Niðurstöður - Vegir'!E27","v":0},{"$f":"'Niðurstöður - Vegir'!F27","v":0},{"$f":"'Niðurstöður - Vegir'!G27","v":0},{"$f":"'Niðurstöður - Vegir'!H27","v":0}]
[null,{"$f":"'Niðurstöður - Vegir'!B47","v":"45.5 Brunnar"},{"$f":"'Niðurstöður - Vegir'!C47","v":0},{"$f":"'Niðurstöður - Vegir'!D47","v":0},{"$f":"'Niðurstöður - Vegir'!E47","v":0},{"$f":"'Niðurstöður - Vegir'!F47","v":0},{"$f":"'Niðurstöður - Vegir'!G47","v":0},{"$f":"'Niðurstöður - Vegir'!H47","v":0},null,null,null,{"$f":"'Niðurstöður - Brýr'!B20","v":"Jarðvinna"},{"$f":"'Niðurstöður - Brýr'!C20","v":0},{"$f":"'Niðurstöður - Brýr'!D20","v":0},{"$f":"'Niðurstöður - Brýr'!E20","v":0},{"$f":"'Niðurstöður - Brýr'!F20","v":0},{"$f":"'Niðurstöður - Brýr'!G20","v":0},{"$f":"'Niðurstöður - Brýr'!H20","v":0}]
[null,{"$f":"'Niðurstöður - Vegir'!B48","v":"45.6 Niðurföll / sandfang"},{"$f":"'Niðurstöður - Vegir'!C48","v":0},{"$f":"'Niðurstöður - Vegir'!D48","v":0},{"$f":"'Niðurstöður - Vegir'!E48","v":0},{"$f":"'Niðurstöður - Vegir'!F48","v":0},{"$f":"'Niðurstöður - Vegir'!G48","v":0},{"$f":"'Niðurstöður - Vegir'!H48","v":0},null,null,null,{"$f":"'Niðurstöður - Brýr'!B21","v":"Plast"},{"$f":"'Niðurstöður - Brýr'!C21","v":0},{"$f":"'Niðurstöður - Brýr'!D21","v":0},{"$f":"'Niðurstöður - Brýr'!E21","v":0},{"$f":"'Niðurstöður - Brýr'!F21","v":0},{"$f":"'Niðurstöður - Brýr'!G21","v":0},{"$f":"'Niðurstöður - Brýr'!H21","v":0}]
[null,{"$f":"'Niðurstöður - Vegir'!B49","v":"45.68 Grjótsvelgur"},{"$f":"'Niðurstöður - Vegir'!C49","v":0},{"$f":"'Niðurstöður - Vegir'!D49","v":0},{"$f":"'Niðurstöður - Vegir'!E49","v":0},{"$f":"'Niðurstöður - Vegir'!F49","v":0},{"$f":"'Niðurstöður - Vegir'!G49","v":0},{"$f":"'Niðurstöður - Vegir'!H49","v":0},null,null,null,{"$f":"'Niðurstöður - Brýr'!B22","v":"Stál"},{"$f":"'Niðurstöður - Brýr'!C22","v":0},{"$f":"'Niðurstöður - Brýr'!D22","v":0},{"$f":"'Niðurstöður - Brýr'!E22","v":0},{"$f":"'Niðurstöður - Brýr'!F22","v":0},{"$f":"'Niðurstöður - Brýr'!G22","v":0},{"$f":"'Niðurstöður - Brýr'!H22","v":0}]
[null,{"$f":"'Niðurstöður - Vegir'!B50","v":"45.1 + 45.8 Gröftur lagnaskurða og fylling í skurði"},{"$f":"'Niðurstöður - Vegir'!C50","v":0},{"$f":"'Niðurstöður - Vegir'!D50","v":0},{"$f":"'Niðurstöður - Vegir'!E50","v":0},{"$f":"'Niðurstöður - Vegir'!F50","v":0},{"$f":"'Niðurstöður - Vegir'!G50","v":0},{"$f":"'Niðurstöður - Vegir'!H50","v":0},null,null,null,{"$f":"'Niðurstöður - Brýr'!B23","v":"Steypa"},{"$f":"'Niðurstöður - Brýr'!C23","v":0},{"$f":"'Niðurstöður - Brýr'!D23","v":0},{"$f":"'Niðurstöður - Brýr'!E23","v":0},{"$f":"'Niðurstöður - Brýr'!F23","v":0},{"$f":"'Niðurstöður - Brýr'!G23","v":0},{"$f":"'Niðurstöður - Brýr'!H23","v":0}]
[null,{"$f":"'Niðurstöður - Vegir'!B51","v":"Rafstrengir"},{"$f":"'Niðurstöður - Vegir'!C51","v":0},{"$f":"'Niðurstöður - Vegir'!D51","v":0},{"$f":"'Niðurstöður - Vegir'!E51","v":0},{"$f":"'Niðurstöður - Vegir'!F51","v":0},{"$f":"'Niðurstöður - Vegir'!G51","v":0},{"$f":"'Niðurstöður - Vegir'!H51","v":0},null,null,null,{"$f":"'Niðurstöður - Brýr'!B24","v":"Rafstrengur"},{"$f":"'Niðurstöður - Brýr'!C24","v":0},{"$f":"'Niðurstöður - Brýr'!D24","v":0},{"$f":"'Niðurstöður - Brýr'!E24","v":0},{"$f":"'Niðurstöður - Brýr'!F24","v":0},{"$f":"'Niðurstöður - Brýr'!G24","v":0},{"$f":"'Niðurstöður - Brýr'!H24","v":0}]
[null,{"$f":"'Niðurstöður - Vegir'!B52","v":"52.2 Styrktarlag"},{"$f":"'Niðurstöður - Vegir'!C52","v":0},{"$f":"'Niðurstöður - Vegir'!D52","v":0},{"$f":"'Niðurstöður - Vegir'!E52","v":0},{"$f":"'Niðurstöður - Vegir'!F52","v":0},{"$f":"'Niðurstöður - Vegir'!G52","v":0},{"$f":"'Niðurstöður - Vegir'!H52","v":0},null,null,null,{"$f":"'Niðurstöður - Brýr'!B25","v":"Malbik"},{"$f":"'Niðurstöður - Brýr'!C25","v":0},{"$f":"'Niðurstöður - Brýr'!D25","v":0},{"$f":"'Niðurstöður - Brýr'!E25","v":0},{"$f":"'Niðurstöður - Brýr'!F25","v":0},{"$f":"'Niðurstöður - Brýr'!G25","v":0},{"$f":"'Niðurstöður - Brýr'!H25","v":0}]
[null,{"$f":"'Niðurstöður - Vegir'!B53","v":"53.1 Óbundið burðarlag"},{"$f":"'Niðurstöður - Vegir'!C53","v":0},{"$f":"'Niðurstöður - Vegir'!D53","v":0},{"$f":"'Niðurstöður - Vegir'!E53","v":0},{"$f":"'Niðurstöður - Vegir'!F53","v":0},{"$f":"'Niðurstöður - Vegir'!G53","v":0},{"$f":"'Niðurstöður - Vegir'!H53","v":0},null,null,null,{"$f":"'Niðurstöður - Brýr'!B26","v":"Timbur"},{"$f":"'Niðurstöður - Brýr'!C26","v":0},{"$f":"'Niðurstöður - Brýr'!D26","v":0},{"$f":"'Niðurstöður - Brýr'!E26","v":0},{"$f":"'Niðurstöður - Brýr'!F26","v":0},{"$f":"'Niðurstöður - Brýr'!G26","v":0},{"$f":"'Niðurstöður - Brýr'!H26","v":0}]
[null,{"$f":"'Niðurstöður - Vegir'!B54","v":"62.1 Klæðing, nýlögn"},{"$f":"'Niðurstöður - Vegir'!C54","v":0},{"$f":"'Niðurstöður - Vegir'!D54","v":0},{"$f":"'Niðurstöður - Vegir'!E54","v":0},{"$f":"'Niðurstöður - Vegir'!F54","v":0},{"$f":"'Niðurstöður - Vegir'!G54","v":0},{"$f":"'Niðurstöður - Vegir'!H54","v":0},null,null,null,{"$f":"'Niðurstöður - Brýr'!B27","v":"Annað"},{"$f":"'Niðurstöður - Brýr'!C27","v":0},{"$f":"'Niðurstöður - Brýr'!D27","v":0},{"$f":"'Niðurstöður - Brýr'!E27","v":0},{"$f":"'Niðurstöður - Brýr'!F27","v":0},{"$f":"'Niðurstöður - Brýr'!G27","v":0},{"$f":"'Niðurstöður - Brýr'!H27","v":0}]
[null,{"$f":"'Niðurstöður - Vegir'!B55","v":"63.42 Burðarlagsmalbik"},{"$f":"'Niðurstöður - Vegir'!C55","v":0},{"$f":"'Niðurstöður - Vegir'!D55","v":0},{"$f":"'Niðurstöður - Vegir'!E55","v":0},{"$f":"'Niðurstöður - Vegir'!F55","v":0},{"$f":"'Niðurstöður - Vegir'!G55","v":0},{"$f":"'Niðurstöður - Vegir'!H55","v":0},null,null,null,{"$f":"'Niðurstöður - Brýr'!B28","v":"Gúmmí"},{"$f":"'Niðurstöður - Brýr'!C28","v":0},{"$f":"'Niðurstöður - Brýr'!D28","v":0},{"$f":"'Niðurstöður - Brýr'!E28","v":0},{"$f":"'Niðurstöður - Brýr'!F28","v":0},{"$f":"'Niðurstöður - Brýr'!G28","v":0},{"$f":"'Niðurstöður - Brýr'!H28","v":0}]
[null,{"$f":"'Niðurstöður - Vegir'!B56","v":"63.43 Slitlagsmalbik"},{"$f":"'Niðurstöður - Vegir'!C56","v":0},{"$f":"'Niðurstöður - Vegir'!D56","v":0},{"$f":"'Niðurstöður - Vegir'!E56","v":0},{"$f":"'Niðurstöður - Vegir'!F56","v":0},{"$f":"'Niðurstöður - Vegir'!G56","v":0},{"$f":"'Niðurstöður - Vegir'!H56","v":0},null,null,null,{"$f":"'Niðurstöður - Brýr'!B29","v":"Dísilolíunotkun á verkstað"},{"$f":"'Niðurstöður - Brýr'!C29","v":0},{"$f":"'Niðurstöður - Brýr'!D29","v":0},{"$f":"'Niðurstöður - Brýr'!E29","v":0},{"$f":"'Niðurstöður - Brýr'!F29","v":0},{"$f":"'Niðurstöður - Brýr'!G29","v":0},{"$f":"'Niðurstöður - Brýr'!H29","v":0}]
[null,{"$f":"'Niðurstöður - Vegir'!B57","v":"68.24 Steypt gangstétt"},{"$f":"'Niðurstöður - Vegir'!C57","v":0},{"$f":"'Niðurstöður - Vegir'!D57","v":0},{"$f":"'Niðurstöður - Vegir'!E57","v":0},{"$f":"'Niðurstöður - Vegir'!F57","v":0},{"$f":"'Niðurstöður - Vegir'!G57","v":0},{"$f":"'Niðurstöður - Vegir'!H57","v":0},null,null,null,{"$f":"'Niðurstöður - Jarðgöng'!B22","v":"Jarðvinna"},{"$f":"'Niðurstöður - Jarðgöng'!C22","v":0},{"$f":"'Niðurstöður - Jarðgöng'!D22","v":0},{"$f":"'Niðurstöður - Jarðgöng'!E22","v":0},{"$f":"'Niðurstöður - Jarðgöng'!F22","v":0},{"$f":"'Niðurstöður - Jarðgöng'!G22","v":0},{"$f":"'Niðurstöður - Jarðgöng'!H22","v":0}]
[null,{"$f":"'Niðurstöður - Vegir'!B58","v":"68.25 Gangstígar/eyjarhringtorg með hellum"},{"$f":"'Niðurstöður - Vegir'!C58","v":0},{"$f":"'Niðurstöður - Vegir'!D58","v":0},{"$f":"'Niðurstöður - Vegir'!E58","v":0},{"$f":"'Niðurstöður - Vegir'!F58","v":0},{"$f":"'Niðurstöður - Vegir'!G58","v":0},{"$f":"'Niðurstöður - Vegir'!H58","v":0},null,null,null,{"$f":"'Niðurstöður - Jarðgöng'!B23","v":"Plast"},{"$f":"'Niðurstöður - Jarðgöng'!C23","v":0},{"$f":"'Niðurstöður - Jarðgöng'!D23","v":0},{"$f":"'Niðurstöður - Jarðgöng'!E23","v":0},{"$f":"'Niðurstöður - Jarðgöng'!F23","v":0},{"$f":"'Niðurstöður - Jarðgöng'!G23","v":0},{"$f":"'Niðurstöður - Jarðgöng'!H23","v":0}]
[null,{"$f":"'Niðurstöður - Vegir'!B59","v":"75.1 Kantsteinar"},{"$f":"'Niðurstöður - Vegir'!C59","v":0},{"$f":"'Niðurstöður - Vegir'!D59","v":0},{"$f":"'Niðurstöður - Vegir'!E59","v":0},{"$f":"'Niðurstöður - Vegir'!F59","v":0},{"$f":"'Niðurstöður - Vegir'!G59","v":0},{"$f":"'Niðurstöður - Vegir'!H59","v":0},null,null,null,{"$f":"'Niðurstöður - Jarðgöng'!B24","v":"Stál"},{"$f":"'Niðurstöður - Jarðgöng'!C24","v":0},{"$f":"'Niðurstöður - Jarðgöng'!D24","v":0},{"$f":"'Niðurstöður - Jarðgöng'!E24","v":0},{"$f":"'Niðurstöður - Jarðgöng'!F24","v":0},{"$f":"'Niðurstöður - Jarðgöng'!G24","v":0},{"$f":"'Niðurstöður - Jarðgöng'!H24","v":0}]
[null,{"$f":"'Niðurstöður - Vegir'!B60","v":"75.2 Eyjar og hringtorg"},{"$f":"'Niðurstöður - Vegir'!C60","v":0},{"$f":"'Niðurstöður - Vegir'!D60","v":0},{"$f":"'Niðurstöður - Vegir'!E60","v":0},{"$f":"'Niðurstöður - Vegir'!F60","v":0},{"$f":"'Niðurstöður - Vegir'!G60","v":0},{"$f":"'Niðurstöður - Vegir'!H60","v":0},null,null,null,{"$f":"'Niðurstöður - Jarðgöng'!B25","v":"Steypa"},{"$f":"'Niðurstöður - Jarðgöng'!C25","v":0},{"$f":"'Niðurstöður - Jarðgöng'!D25","v":0},{"$f":"'Niðurstöður - Jarðgöng'!E25","v":0},{"$f":"'Niðurstöður - Jarðgöng'!F25","v":0},{"$f":"'Niðurstöður - Jarðgöng'!G25","v":0},{"$f":"'Niðurstöður - Jarðgöng'!H25","v":0}]
[null,{"$f":"'Niðurstöður - Vegir'!B61","v":"75.6 Vegrið"},{"$f":"'Niðurstöður - Vegir'!C61","v":0},{"$f":"'Niðurstöður - Vegir'!D61","v":0},{"$f":"'Niðurstöður - Vegir'!E61","v":0},{"$f":"'Niðurstöður - Vegir'!F61","v":0},{"$f":"'Niðurstöður - Vegir'!G61","v":0},{"$f":"'Niðurstöður - Vegir'!H61","v":0},null,null,null,{"$f":"'Niðurstöður - Jarðgöng'!B26","v":"Rafstrengur"},{"$f":"'Niðurstöður - Jarðgöng'!C26","v":0},{"$f":"'Niðurstöður - Jarðgöng'!D26","v":0},{"$f":"'Niðurstöður - Jarðgöng'!E26","v":0},{"$f":"'Niðurstöður - Jarðgöng'!F26","v":0},{"$f":"'Niðurstöður - Jarðgöng'!G26","v":0},{"$f":"'Niðurstöður - Jarðgöng'!H26","v":0}]
[null,{"$f":"'Niðurstöður - Vegir'!B62","v":"76.45 Ljósastuarar"},{"$f":"'Niðurstöður - Vegir'!C62","v":0},{"$f":"'Niðurstöður - Vegir'!D62","v":0},{"$f":"'Niðurstöður - Vegir'!E62","v":0},{"$f":"'Niðurstöður - Vegir'!F62","v":0},{"$f":"'Niðurstöður - Vegir'!G62","v":0},{"$f":"'Niðurstöður - Vegir'!H62","v":0},null,null,null,{"$f":"'Niðurstöður - Jarðgöng'!B27","v":"Malbik"},{"$f":"'Niðurstöður - Jarðgöng'!C27","v":0},{"$f":"'Niðurstöður - Jarðgöng'!D27","v":0},{"$f":"'Niðurstöður - Jarðgöng'!E27","v":0},{"$f":"'Niðurstöður - Jarðgöng'!F27","v":0},{"$f":"'Niðurstöður - Jarðgöng'!G27","v":0},{"$f":"'Niðurstöður - Jarðgöng'!H27","v":0}]
[null,{"$f":"'Niðurstöður - Vegir'!B63","v":"75.62 Vegrið á brú"},{"$f":"'Niðurstöður - Vegir'!C63","v":0},{"$f":"'Niðurstöður - Vegir'!D63","v":0},{"$f":"'Niðurstöður - Vegir'!E63","v":0},{"$f":"'Niðurstöður - Vegir'!F63","v":0},{"$f":"'Niðurstöður - Vegir'!G63","v":0},{"$f":"'Niðurstöður - Vegir'!H63","v":0},null,null,null,{"$f":"'Niðurstöður - Jarðgöng'!B28","v":"Timbur"},{"$f":"'Niðurstöður - Jarðgöng'!C28","v":0},{"$f":"'Niðurstöður - Jarðgöng'!D28","v":0},{"$f":"'Niðurstöður - Jarðgöng'!E28","v":0},{"$f":"'Niðurstöður - Jarðgöng'!F28","v":0},{"$f":"'Niðurstöður - Jarðgöng'!G28","v":0},{"$f":"'Niðurstöður - Jarðgöng'!H28","v":0}]
[null,{"$f":"'Niðurstöður - Vegir'!B64","v":"75.7 Handrið"},{"$f":"'Niðurstöður - Vegir'!C64","v":0},{"$f":"'Niðurstöður - Vegir'!D64","v":0},{"$f":"'Niðurstöður - Vegir'!E64","v":0},{"$f":"'Niðurstöður - Vegir'!F64","v":0},{"$f":"'Niðurstöður - Vegir'!G64","v":0},{"$f":"'Niðurstöður - Vegir'!H64","v":0},null,null,null,{"$f":"'Niðurstöður - Jarðgöng'!B29","v":"Annað"},{"$f":"'Niðurstöður - Jarðgöng'!C29","v":0},{"$f":"'Niðurstöður - Jarðgöng'!D29","v":0},{"$f":"'Niðurstöður - Jarðgöng'!E29","v":0},{"$f":"'Niðurstöður - Jarðgöng'!F29","v":0},{"$f":"'Niðurstöður - Jarðgöng'!G29","v":0},{"$f":"'Niðurstöður - Jarðgöng'!H29","v":0}]
[null,null,null,{"$f":"SUM(D132:D161)","v":0},null,null,null,null,null,null,null,{"$f":"'Niðurstöður - Jarðgöng'!B30","v":"Gúmmí"},{"$f":"'Niðurstöður - Jarðgöng'!C30","v":0},{"$f":"'Niðurstöður - Jarðgöng'!D30","v":0},{"$f":"'Niðurstöður - Jarðgöng'!E30","v":0},{"$f":"'Niðurstöður - Jarðgöng'!F30","v":0},{"$f":"'Niðurstöður - Jarðgöng'!G30","v":0},{"$f":"'Niðurstöður - Jarðgöng'!H30","v":0}]
[null,null,null,null,null,null,null,null,null,null,null,{"$f":"'Niðurstöður - Jarðgöng'!B31","v":"Dísilolíunotkun á verkstað"},{"$f":"'Niðurstöður - Jarðgöng'!C31","v":0},{"$f":"'Niðurstöður - Jarðgöng'!D31","v":0},{"$f":"'Niðurstöður - Jarðgöng'!E31","v":0},{"$f":"'Niðurstöður - Jarðgöng'!F31","v":0},{"$f":"'Niðurstöður - Jarðgöng'!G31","v":0},{"$f":"'Niðurstöður - Jarðgöng'!H31","v":0}]
[null,{"$f":"'Niðurstöður - Brýr'!B37","v":"32.1 Bergskeringar í vegstæði"},{"$f":"'Niðurstöður - Brýr'!C37","v":0},{"$f":"'Niðurstöður - Brýr'!D37","v":0},{"$f":"'Niðurstöður - Brýr'!E37","v":0},{"$f":"'Niðurstöður - Brýr'!F37","v":0},{"$f":"'Niðurstöður - Brýr'!G37","v":0},{"$f":"'Niðurstöður - Brýr'!H37","v":0},null,null,null,{"$f":"'Niðurstöður - Gönguleiðir'!B20","v":"Jarðvinna"},{"$f":"'Niðurstöður - Gönguleiðir'!C20","v":0},{"$f":"'Niðurstöður - Gönguleiðir'!D20","v":0},{"$f":"'Niðurstöður - Gönguleiðir'!E20","v":0},{"$f":"'Niðurstöður - Gönguleiðir'!F20","v":0},{"$f":"'Niðurstöður - Gönguleiðir'!G20","v":0},{"$f":"'Niðurstöður - Gönguleiðir'!H20","v":0}]
[null,{"$f":"'Niðurstöður - Brýr'!B38","v":"32.2 Bergskeringar í námu"},{"$f":"'Niðurstöður - Brýr'!C38","v":0},{"$f":"'Niðurstöður - Brýr'!D38","v":0},{"$f":"'Niðurstöður - Brýr'!E38","v":0},{"$f":"'Niðurstöður - Brýr'!F38","v":0},{"$f":"'Niðurstöður - Brýr'!G38","v":0},{"$f":"'Niðurstöður - Brýr'!H38","v":0},null,null,null,{"$f":"'Niðurstöður - Gönguleiðir'!B21","v":"Plast"},{"$f":"'Niðurstöður - Gönguleiðir'!C21","v":0},{"$f":"'Niðurstöður - Gönguleiðir'!D21","v":0},{"$f":"'Niðurstöður - Gönguleiðir'!E21","v":0},{"$f":"'Niðurstöður - Gönguleiðir'!F21","v":0},{"$f":"'Niðurstöður - Gönguleiðir'!G21","v":0},{"$f":"'Niðurstöður - Gönguleiðir'!H21","v":0}]
[null,{"$f":"'Niðurstöður - Brýr'!B39","v":"33.1 Fyllingarefni úr skeringum"},{"$f":"'Niðurstöður - Brýr'!C39","v":0},{"$f":"'Niðurstöður - Brýr'!D39","v":0},{"$f":"'Niðurstöður - Brýr'!E39","v":0},{"$f":"'Niðurstöður - Brýr'!F39","v":0},{"$f":"'Niðurstöður - Brýr'!G39","v":0},{"$f":"'Niðurstöður - Brýr'!H39","v":0},null,null,null,{"$f":"'Niðurstöður - Gönguleiðir'!B22","v":"Stál"},{"$f":"'Niðurstöður - Gönguleiðir'!C22","v":0},{"$f":"'Niðurstöður - Gönguleiðir'!D22","v":0},{"$f":"'Niðurstöður - Gönguleiðir'!E22","v":0},{"$f":"'Niðurstöður - Gönguleiðir'!F22","v":0},{"$f":"'Niðurstöður - Gönguleiðir'!G22","v":0},{"$f":"'Niðurstöður - Gönguleiðir'!H22","v":0}]
[null,{"$f":"'Niðurstöður - Brýr'!B40","v":"33.2 Fyllingarefni úr námu"},{"$f":"'Niðurstöður - Brýr'!C40","v":0},{"$f":"'Niðurstöður - Brýr'!D40","v":0},{"$f":"'Niðurstöður - Brýr'!E40","v":0},{"$f":"'Niðurstöður - Brýr'!F40","v":0},{"$f":"'Niðurstöður - Brýr'!G40","v":0},{"$f":"'Niðurstöður - Brýr'!H40","v":0},null,null,null,{"$f":"'Niðurstöður - Gönguleiðir'!B23","v":"Steypa"},{"$f":"'Niðurstöður - Gönguleiðir'!C23","v":0},{"$f":"'Niðurstöður - Gönguleiðir'!D23","v":0},{"$f":"'Niðurstöður - Gönguleiðir'!E23","v":0},{"$f":"'Niðurstöður - Gönguleiðir'!F23","v":0},{"$f":"'Niðurstöður - Gönguleiðir'!G23","v":0},{"$f":"'Niðurstöður - Gönguleiðir'!H23","v":0}]
[null,{"$f":"'Niðurstöður - Brýr'!B41","v":"34.1 Fláafleygar, efni úr skeringum"},{"$f":"'Niðurstöður - Brýr'!C41","v":0},{"$f":"'Niðurstöður - Brýr'!D41","v":0},{"$f":"'Niðurstöður - Brýr'!E41","v":0},{"$f":"'Niðurstöður - Brýr'!F41","v":0},{"$f":"'Niðurstöður - Brýr'!G41","v":0},{"$f":"'Niðurstöður - Brýr'!H41","v":0},null,null,null,{"$f":"'Niðurstöður - Gönguleiðir'!B24","v":"Rafstrengur"},{"$f":"'Niðurstöður - Gönguleiðir'!C24","v":0},{"$f":"'Niðurstöður - Gönguleiðir'!D24","v":0},{"$f":"'Niðurstöður - Gönguleiðir'!E24","v":0},{"$f":"'Niðurstöður - Gönguleiðir'!F24","v":0},{"$f":"'Niðurstöður - Gönguleiðir'!G24","v":0},{"$f":"'Niðurstöður - Gönguleiðir'!H24","v":0}]
[null,{"$f":"'Niðurstöður - Brýr'!B42","v":"34.8 Ónothæfu efni jafnað á losunarstað"},{"$f":"'Niðurstöður - Brýr'!C42","v":0},{"$f":"'Niðurstöður - Brýr'!D42","v":0},{"$f":"'Niðurstöður - Brýr'!E42","v":0},{"$f":"'Niðurstöður - Brýr'!F42","v":0},{"$f":"'Niðurstöður - Brýr'!G42","v":0},{"$f":"'Niðurstöður - Brýr'!H42","v":0},null,null,null,{"$f":"'Niðurstöður - Gönguleiðir'!B25","v":"Malbik"},{"$f":"'Niðurstöður - Gönguleiðir'!C25","v":0},{"$f":"'Niðurstöður - Gönguleiðir'!D25","v":0},{"$f":"'Niðurstöður - Gönguleiðir'!E25","v":0},{"$f":"'Niðurstöður - Gönguleiðir'!F25","v":0},{"$f":"'Niðurstöður - Gönguleiðir'!G25","v":0},{"$f":"'Niðurstöður - Gönguleiðir'!H25","v":0}]
[null,{"$f":"'Niðurstöður - Brýr'!B43","v":"36.2 Grjótvörn"},{"$f":"'Niðurstöður - Brýr'!C43","v":0},{"$f":"'Niðurstöður - Brýr'!D43","v":0},{"$f":"'Niðurstöður - Brýr'!E43","v":0},{"$f":"'Niðurstöður - Brýr'!F43","v":0},{"$f":"'Niðurstöður - Brýr'!G43","v":0},{"$f":"'Niðurstöður - Brýr'!H43","v":0},null,null,null,{"$f":"'Niðurstöður - Gönguleiðir'!B26","v":"Dísilolíunotkun á verkstað"},{"$f":"'Niðurstöður - Gönguleiðir'!C26","v":0},{"$f":"'Niðurstöður - Gönguleiðir'!D26","v":0},{"$f":"'Niðurstöður - Gönguleiðir'!E26","v":0},{"$f":"'Niðurstöður - Gönguleiðir'!F26","v":0},{"$f":"'Niðurstöður - Gönguleiðir'!G26","v":0},{"$f":"'Niðurstöður - Gönguleiðir'!H26","v":0}]
[null,{"$f":"'Niðurstöður - Brýr'!B44","v":"42.3 Plaströr, fráveita"},{"$f":"'Niðurstöður - Brýr'!C44","v":0},{"$f":"'Niðurstöður - Brýr'!D44","v":0},{"$f":"'Niðurstöður - Brýr'!E44","v":0},{"$f":"'Niðurstöður - Brýr'!F44","v":0},{"$f":"'Niðurstöður - Brýr'!G44","v":0},{"$f":"'Niðurstöður - Brýr'!H44","v":0}]
[null,{"$f":"'Niðurstöður - Brýr'!B45","v":"45.5 Brunnar"},{"$f":"'Niðurstöður - Brýr'!C45","v":0},{"$f":"'Niðurstöður - Brýr'!D45","v":0},{"$f":"'Niðurstöður - Brýr'!E45","v":0},{"$f":"'Niðurstöður - Brýr'!F45","v":0},{"$f":"'Niðurstöður - Brýr'!G45","v":0},{"$f":"'Niðurstöður - Brýr'!H45","v":0}]
[null,{"$f":"'Niðurstöður - Brýr'!B46","v":"45.6 Niðurföll / sandfang"},{"$f":"'Niðurstöður - Brýr'!C46","v":0},{"$f":"'Niðurstöður - Brýr'!D46","v":0},{"$f":"'Niðurstöður - Brýr'!E46","v":0},{"$f":"'Niðurstöður - Brýr'!F46","v":0},{"$f":"'Niðurstöður - Brýr'!G46","v":0},{"$f":"'Niðurstöður - Brýr'!H46","v":0}]
[null,{"$f":"'Niðurstöður - Brýr'!B47","v":"45.68 Grjótsvelgur"},{"$f":"'Niðurstöður - Brýr'!C47","v":0},{"$f":"'Niðurstöður - Brýr'!D47","v":0},{"$f":"'Niðurstöður - Brýr'!E47","v":0},{"$f":"'Niðurstöður - Brýr'!F47","v":0},{"$f":"'Niðurstöður - Brýr'!G47","v":0},{"$f":"'Niðurstöður - Brýr'!H47","v":0}]
[null,{"$f":"'Niðurstöður - Brýr'!B48","v":"45.1 + 45.8 Gröftur lagnaskurða og fylling í skurði"},{"$f":"'Niðurstöður - Brýr'!C48","v":0},{"$f":"'Niðurstöður - Brýr'!D48","v":0},{"$f":"'Niðurstöður - Brýr'!E48","v":0},{"$f":"'Niðurstöður - Brýr'!F48","v":0},{"$f":"'Niðurstöður - Brýr'!G48","v":0},{"$f":"'Niðurstöður - Brýr'!H48","v":0}]
[null,{"$f":"'Niðurstöður - Brýr'!B49","v":"Rafstrengir"},{"$f":"'Niðurstöður - Brýr'!C49","v":0},{"$f":"'Niðurstöður - Brýr'!D49","v":0},{"$f":"'Niðurstöður - Brýr'!E49","v":0},{"$f":"'Niðurstöður - Brýr'!F49","v":0},{"$f":"'Niðurstöður - Brýr'!G49","v":0},{"$f":"'Niðurstöður - Brýr'!H49","v":0}]
[null,{"$f":"'Niðurstöður - Brýr'!B50","v":"63.42 Burðarlagsmalbik"},{"$f":"'Niðurstöður - Brýr'!C50","v":0},{"$f":"'Niðurstöður - Brýr'!D50","v":0},{"$f":"'Niðurstöður - Brýr'!E50","v":0},{"$f":"'Niðurstöður - Brýr'!F50","v":0},{"$f":"'Niðurstöður - Brýr'!G50","v":0},{"$f":"'Niðurstöður - Brýr'!H50","v":0}]
[null,{"$f":"'Niðurstöður - Brýr'!B51","v":"63.43 Slitlagsmalbik"},{"$f":"'Niðurstöður - Brýr'!C51","v":0},{"$f":"'Niðurstöður - Brýr'!D51","v":0},{"$f":"'Niðurstöður - Brýr'!E51","v":0},{"$f":"'Niðurstöður - Brýr'!F51","v":0},{"$f":"'Niðurstöður - Brýr'!G51","v":0},{"$f":"'Niðurstöður - Brýr'!H51","v":0}]
[null,{"$f":"'Niðurstöður - Brýr'!B52","v":"68.24 Steypt gangstétt"},{"$f":"'Niðurstöður - Brýr'!C52","v":0},{"$f":"'Niðurstöður - Brýr'!D52","v":0},{"$f":"'Niðurstöður - Brýr'!E52","v":0},{"$f":"'Niðurstöður - Brýr'!F52","v":0},{"$f":"'Niðurstöður - Brýr'!G52","v":0},{"$f":"'Niðurstöður - Brýr'!H52","v":0}]
[null,{"$f":"'Niðurstöður - Brýr'!B53","v":"68.25 Gangstígar/eyjarhringtorg með hellum"},{"$f":"'Niðurstöður - Brýr'!C53","v":0},{"$f":"'Niðurstöður - Brýr'!D53","v":0},{"$f":"'Niðurstöður - Brýr'!E53","v":0},{"$f":"'Niðurstöður - Brýr'!F53","v":0},{"$f":"'Niðurstöður - Brýr'!G53","v":0},{"$f":"'Niðurstöður - Brýr'!H53","v":0}]
[null,{"$f":"'Niðurstöður - Brýr'!B54","v":"75.1 Kantsteinar"},{"$f":"'Niðurstöður - Brýr'!C54","v":0},{"$f":"'Niðurstöður - Brýr'!D54","v":0},{"$f":"'Niðurstöður - Brýr'!E54","v":0},{"$f":"'Niðurstöður - Brýr'!F54","v":0},{"$f":"'Niðurstöður - Brýr'!G54","v":0},{"$f":"'Niðurstöður - Brýr'!H54","v":0}]
[null,{"$f":"'Niðurstöður - Brýr'!B55","v":"75.2 Eyjar og hringtorg"},{"$f":"'Niðurstöður - Brýr'!C55","v":0},{"$f":"'Niðurstöður - Brýr'!D55","v":0},{"$f":"'Niðurstöður - Brýr'!E55","v":0},{"$f":"'Niðurstöður - Brýr'!F55","v":0},{"$f":"'Niðurstöður - Brýr'!G55","v":0},{"$f":"'Niðurstöður - Brýr'!H55","v":0}]
[null,{"$f":"'Niðurstöður - Brýr'!B56","v":"75.6 Vegrið"},{"$f":"'Niðurstöður - Brýr'!C56","v":0},{"$f":"'Niðurstöður - Brýr'!D56","v":0},{"$f":"'Niðurstöður - Brýr'!E56","v":0},{"$f":"'Niðurstöður - Brýr'!F56","v":0},{"$f":"'Niðurstöður - Brýr'!G56","v":0},{"$f":"'Niðurstöður - Brýr'!H56","v":0}]
[null,{"$f":"'Niðurstöður - Brýr'!B57","v":"76.45 Ljósastuarar"},{"$f":"'Niðurstöður - Brýr'!C57","v":0},{"$f":"'Niðurstöður - Brýr'!D57","v":0},{"$f":"'Niðurstöður - Brýr'!E57","v":0},{"$f":"'Niðurstöður - Brýr'!F57","v":0},{"$f":"'Niðurstöður - Brýr'!G57","v":0},{"$f":"'Niðurstöður - Brýr'!H57","v":0}]
[null,{"$f":"'Niðurstöður - Brýr'!B58","v":"75.62 Vegrið á brú"},{"$f":"'Niðurstöður - Brýr'!C58","v":0},{"$f":"'Niðurstöður - Brýr'!D58","v":0},{"$f":"'Niðurstöður - Brýr'!E58","v":0},{"$f":"'Niðurstöður - Brýr'!F58","v":0},{"$f":"'Niðurstöður - Brýr'!G58","v":0},{"$f":"'Niðurstöður - Brýr'!H58","v":0}]
[null,{"$f":"'Niðurstöður - Brýr'!B59","v":"75.7 Handrið"},{"$f":"'Niðurstöður - Brýr'!C59","v":0},{"$f":"'Niðurstöður - Brýr'!D59","v":0},{"$f":"'Niðurstöður - Brýr'!E59","v":0},{"$f":"'Niðurstöður - Brýr'!F59","v":0},{"$f":"'Niðurstöður - Brýr'!G59","v":0},{"$f":"'Niðurstöður - Brýr'!H59","v":0}]
[null,{"$f":"'Niðurstöður - Brýr'!B60","v":"81.31 Fylling við steypt mannvirki"},{"$f":"'Niðurstöður - Brýr'!C60","v":0},{"$f":"'Niðurstöður - Brýr'!D60","v":0},{"$f":"'Niðurstöður - Brýr'!E60","v":0},{"$f":"'Niðurstöður - Brýr'!F60","v":0},{"$f":"'Niðurstöður - Brýr'!G60","v":0},{"$f":"'Niðurstöður - Brýr'!H60","v":0}]
[null,{"$f":"'Niðurstöður - Brýr'!B61","v":"83.11 Bergboltar"},{"$f":"'Niðurstöður - Brýr'!C61","v":0},{"$f":"'Niðurstöður - Brýr'!D61","v":0},{"$f":"'Niðurstöður - Brýr'!E61","v":0},{"$f":"'Niðurstöður - Brýr'!F61","v":0},{"$f":"'Niðurstöður - Brýr'!G61","v":0},{"$f":"'Niðurstöður - Brýr'!H61","v":0}]
[null,{"$f":"'Niðurstöður - Brýr'!B62","v":"83.212 Steyptir staurar"},{"$f":"'Niðurstöður - Brýr'!C62","v":0},{"$f":"'Niðurstöður - Brýr'!D62","v":0},{"$f":"'Niðurstöður - Brýr'!E62","v":0},{"$f":"'Niðurstöður - Brýr'!F62","v":0},{"$f":"'Niðurstöður - Brýr'!G62","v":0},{"$f":"'Niðurstöður - Brýr'!H62","v":0}]
[null,{"$f":"'Niðurstöður - Brýr'!B63","v":"83.222 Tréstaurar"},{"$f":"'Niðurstöður - Brýr'!C63","v":0},{"$f":"'Niðurstöður - Brýr'!D63","v":0},{"$f":"'Niðurstöður - Brýr'!E63","v":0},{"$f":"'Niðurstöður - Brýr'!F63","v":0},{"$f":"'Niðurstöður - Brýr'!G63","v":0},{"$f":"'Niðurstöður - Brýr'!H63","v":0}]
[null,{"$f":"'Niðurstöður - Brýr'!B64","v":"83.232 Stálstaurar"},{"$f":"'Niðurstöður - Brýr'!C64","v":0},{"$f":"'Niðurstöður - Brýr'!D64","v":0},{"$f":"'Niðurstöður - Brýr'!E64","v":0},{"$f":"'Niðurstöður - Brýr'!F64","v":0},{"$f":"'Niðurstöður - Brýr'!G64","v":0},{"$f":"'Niðurstöður - Brýr'!H64","v":0}]
[null,{"$f":"'Niðurstöður - Brýr'!B65","v":"83.6 Stálþil"},{"$f":"'Niðurstöður - Brýr'!C65","v":0},{"$f":"'Niðurstöður - Brýr'!D65","v":0},{"$f":"'Niðurstöður - Brýr'!E65","v":0},{"$f":"'Niðurstöður - Brýr'!F65","v":0},{"$f":"'Niðurstöður - Brýr'!G65","v":0},{"$f":"'Niðurstöður - Brýr'!H65","v":0}]
[null,{"$f":"'Niðurstöður - Brýr'!B66","v":"84.2 Mót"},{"$f":"'Niðurstöður - Brýr'!C66","v":0},{"$f":"'Niðurstöður - Brýr'!D66","v":0},{"$f":"'Niðurstöður - Brýr'!E66","v":0},{"$f":"'Niðurstöður - Brýr'!F66","v":0},{"$f":"'Niðurstöður - Brýr'!G66","v":0},{"$f":"'Niðurstöður - Brýr'!H66","v":0}]
[null,{"$f":"'Niðurstöður - Brýr'!B67","v":"84.31 Slakbent járnalögn"},{"$f":"'Niðurstöður - Brýr'!C67","v":0},{"$f":"'Niðurstöður - Brýr'!D67","v":0},{"$f":"'Niðurstöður - Brýr'!E67","v":0},{"$f":"'Niðurstöður - Brýr'!F67","v":0},{"$f":"'Niðurstöður - Brýr'!G67","v":0},{"$f":"'Niðurstöður - Brýr'!H67","v":0}]
[null,{"$f":"'Niðurstöður - Brýr'!B68","v":"84.36 Eftirspennt járnalögn"},{"$f":"'Niðurstöður - Brýr'!C68","v":0},{"$f":"'Niðurstöður - Brýr'!D68","v":0},{"$f":"'Niðurstöður - Brýr'!E68","v":0},{"$f":"'Niðurstöður - Brýr'!F68","v":0},{"$f":"'Niðurstöður - Brýr'!G68","v":0},{"$f":"'Niðurstöður - Brýr'!H68","v":0}]
[null,{"$f":"'Niðurstöður - Brýr'!B69","v":"84.4 Steypa"},{"$f":"'Niðurstöður - Brýr'!C69","v":0},{"$f":"'Niðurstöður - Brýr'!D69","v":0},{"$f":"'Niðurstöður - Brýr'!E69","v":0},{"$f":"'Niðurstöður - Brýr'!F69","v":0},{"$f":"'Niðurstöður - Brýr'!G69","v":0},{"$f":"'Niðurstöður - Brýr'!H69","v":0}]
[null,{"$f":"'Niðurstöður - Brýr'!B70","v":"84.57 Vatnsvarnalag undir malbiki"},{"$f":"'Niðurstöður - Brýr'!C70","v":0},{"$f":"'Niðurstöður - Brýr'!D70","v":0},{"$f":"'Niðurstöður - Brýr'!E70","v":0},{"$f":"'Niðurstöður - Brýr'!F70","v":0},{"$f":"'Niðurstöður - Brýr'!G70","v":0},{"$f":"'Niðurstöður - Brýr'!H70","v":0}]
[null,{"$f":"'Niðurstöður - Brýr'!B71","v":"85.1 Stálvirki"},{"$f":"'Niðurstöður - Brýr'!C71","v":0},{"$f":"'Niðurstöður - Brýr'!D71","v":0},{"$f":"'Niðurstöður - Brýr'!E71","v":0},{"$f":"'Niðurstöður - Brýr'!F71","v":0},{"$f":"'Niðurstöður - Brýr'!G71","v":0},{"$f":"'Niðurstöður - Brýr'!H71","v":0}]
[null,{"$f":"'Niðurstöður - Brýr'!B72","v":"86.1 Legur"},{"$f":"'Niðurstöður - Brýr'!C72","v":0},{"$f":"'Niðurstöður - Brýr'!D72","v":0},{"$f":"'Niðurstöður - Brýr'!E72","v":0},{"$f":"'Niðurstöður - Brýr'!F72","v":0},{"$f":"'Niðurstöður - Brýr'!G72","v":0},{"$f":"'Niðurstöður - Brýr'!H72","v":0}]
[null,{"$f":"'Niðurstöður - Brýr'!B73","v":"86.4 Þensluraufar"},{"$f":"'Niðurstöður - Brýr'!C73","v":0},{"$f":"'Niðurstöður - Brýr'!D73","v":0},{"$f":"'Niðurstöður - Brýr'!E73","v":0},{"$f":"'Niðurstöður - Brýr'!F73","v":0},{"$f":"'Niðurstöður - Brýr'!G73","v":0},{"$f":"'Niðurstöður - Brýr'!H73","v":0}]
[null,null,null,{"$f":"SUM(D164:D200)","v":0}]
[]
[null,{"$f":"'Niðurstöður - Jarðgöng'!B39","v":"32.1 Bergskeringar í vegstæði"},{"$f":"'Niðurstöður - Jarðgöng'!C39","v":0},{"$f":"'Niðurstöður - Jarðgöng'!D39","v":0},{"$f":"'Niðurstöður - Jarðgöng'!E39","v":0},{"$f":"'Niðurstöður - Jarðgöng'!F39","v":0},{"$f":"'Niðurstöður - Jarðgöng'!G39","v":0},{"$f":"'Niðurstöður - Jarðgöng'!H39","v":0}]
[null,{"$f":"'Niðurstöður - Jarðgöng'!B40","v":"32.2 Bergskeringar í námu"},{"$f":"'Niðurstöður - Jarðgöng'!C40","v":0},{"$f":"'Niðurstöður - Jarðgöng'!D40","v":0},{"$f":"'Niðurstöður - Jarðgöng'!E40","v":0},{"$f":"'Niðurstöður - Jarðgöng'!F40","v":0},{"$f":"'Niðurstöður - Jarðgöng'!G40","v":0},{"$f":"'Niðurstöður - Jarðgöng'!H40","v":0}]
[null,{"$f":"'Niðurstöður - Jarðgöng'!B41","v":"33.1 Fyllingarefni úr skeringum"},{"$f":"'Niðurstöður - Jarðgöng'!C41","v":0},{"$f":"'Niðurstöður - Jarðgöng'!D41","v":0},{"$f":"'Niðurstöður - Jarðgöng'!E41","v":0},{"$f":"'Niðurstöður - Jarðgöng'!F41","v":0},{"$f":"'Niðurstöður - Jarðgöng'!G41","v":0},{"$f":"'Niðurstöður - Jarðgöng'!H41","v":0}]
[null,{"$f":"'Niðurstöður - Jarðgöng'!B42","v":"33.2 Fyllingarefni úr námu"},{"$f":"'Niðurstöður - Jarðgöng'!C42","v":0},{"$f":"'Niðurstöður - Jarðgöng'!D42","v":0},{"$f":"'Niðurstöður - Jarðgöng'!E42","v":0},{"$f":"'Niðurstöður - Jarðgöng'!F42","v":0},{"$f":"'Niðurstöður - Jarðgöng'!G42","v":0},{"$f":"'Niðurstöður - Jarðgöng'!H42","v":0}]
[null,{"$f":"'Niðurstöður - Jarðgöng'!B43","v":"34.1 Fláafleygar, efni úr skeringum"},{"$f":"'Niðurstöður - Jarðgöng'!C43","v":0},{"$f":"'Niðurstöður - Jarðgöng'!D43","v":0},{"$f":"'Niðurstöður - Jarðgöng'!E43","v":0},{"$f":"'Niðurstöður - Jarðgöng'!F43","v":0},{"$f":"'Niðurstöður - Jarðgöng'!G43","v":0},{"$f":"'Niðurstöður - Jarðgöng'!H43","v":0}]
[null,{"$f":"'Niðurstöður - Jarðgöng'!B44","v":"34.8 Ónothæfu efni jafnað á losunarstað"},{"$f":"'Niðurstöður - Jarðgöng'!C44","v":0},{"$f":"'Niðurstöður - Jarðgöng'!D44","v":0},{"$f":"'Niðurstöður - Jarðgöng'!E44","v":0},{"$f":"'Niðurstöður - Jarðgöng'!F44","v":0},{"$f":"'Niðurstöður - Jarðgöng'!G44","v":0},{"$f":"'Niðurstöður - Jarðgöng'!H44","v":0}]
[null,{"$f":"'Niðurstöður - Jarðgöng'!B45","v":"36.2 Grjótvörn"},{"$f":"'Niðurstöður - Jarðgöng'!C45","v":0},{"$f":"'Niðurstöður - Jarðgöng'!D45","v":0},{"$f":"'Niðurstöður - Jarðgöng'!E45","v":0},{"$f":"'Niðurstöður - Jarðgöng'!F45","v":0},{"$f":"'Niðurstöður - Jarðgöng'!G45","v":0},{"$f":"'Niðurstöður - Jarðgöng'!H45","v":0}]
[null,{"$f":"'Niðurstöður - Jarðgöng'!B46","v":"45.71 Plaströr, vatnsveita"},{"$f":"'Niðurstöður - Jarðgöng'!C46","v":0},{"$f":"'Niðurstöður - Jarðgöng'!D46","v":0},{"$f":"'Niðurstöður - Jarðgöng'!E46","v":0},{"$f":"'Niðurstöður - Jarðgöng'!F46","v":0},{"$f":"'Niðurstöður - Jarðgöng'!G46","v":0},{"$f":"'Niðurstöður - Jarðgöng'!H46","v":0}]
[null,{"$f":"'Niðurstöður - Jarðgöng'!B47","v":"42.3 Plaströr, fráveita"},{"$f":"'Niðurstöður - Jarðgöng'!C47","v":0},{"$f":"'Niðurstöður - Jarðgöng'!D47","v":0},{"$f":"'Niðurstöður - Jarðgöng'!E47","v":0},{"$f":"'Niðurstöður - Jarðgöng'!F47","v":0},{"$f":"'Niðurstöður - Jarðgöng'!G47","v":0},{"$f":"'Niðurstöður - Jarðgöng'!H47","v":0}]
[null,{"$f":"'Niðurstöður - Jarðgöng'!B48","v":"45.72 Hitaveiturör"},{"$f":"'Niðurstöður - Jarðgöng'!C48","v":0},{"$f":"'Niðurstöður - Jarðgöng'!D48","v":0},{"$f":"'Niðurstöður - Jarðgöng'!E48","v":0},{"$f":"'Niðurstöður - Jarðgöng'!F48","v":0},{"$f":"'Niðurstöður - Jarðgöng'!G48","v":0},{"$f":"'Niðurstöður - Jarðgöng'!H48","v":0}]
[null,{"$f":"'Niðurstöður - Jarðgöng'!B49","v":"42.4 Stálrör í ræsi"},{"$f":"'Niðurstöður - Jarðgöng'!C49","v":0},{"$f":"'Niðurstöður - Jarðgöng'!D49","v":0},{"$f":"'Niðurstöður - Jarðgöng'!E49","v":0},{"$f":"'Niðurstöður - Jarðgöng'!F49","v":0},{"$f":"'Niðurstöður - Jarðgöng'!G49","v":0},{"$f":"'Niðurstöður - Jarðgöng'!H49","v":0}]
[null,{"$f":"'Niðurstöður - Jarðgöng'!B50","v":"45.4 Steypt ofanvatnsræsi"},{"$f":"'Niðurstöður - Jarðgöng'!C50","v":0},{"$f":"'Niðurstöður - Jarðgöng'!D50","v":0},{"$f":"'Niðurstöður - Jarðgöng'!E50","v":0},{"$f":"'Niðurstöður - Jarðgöng'!F50","v":0},{"$f":"'Niðurstöður - Jarðgöng'!G50","v":0},{"$f":"'Niðurstöður - Jarðgöng'!H50","v":0}]
[null,{"$f":"'Niðurstöður - Jarðgöng'!B51","v":"45.5 Brunnar"},{"$f":"'Niðurstöður - Jarðgöng'!C51","v":0},{"$f":"'Niðurstöður - Jarðgöng'!D51","v":0},{"$f":"'Niðurstöður - Jarðgöng'!E51","v":0},{"$f":"'Niðurstöður - Jarðgöng'!F51","v":0},{"$f":"'Niðurstöður - Jarðgöng'!G51","v":0},{"$f":"'Niðurstöður - Jarðgöng'!H51","v":0}]
[null,{"$f":"'Niðurstöður - Jarðgöng'!B52","v":"45.6 Niðurföll / sandfang"},{"$f":"'Niðurstöður - Jarðgöng'!C52","v":0},{"$f":"'Niðurstöður - Jarðgöng'!D52","v":0},{"$f":"'Niðurstöður - Jarðgöng'!E52","v":0},{"$f":"'Niðurstöður - Jarðgöng'!F52","v":0},{"$f":"'Niðurstöður - Jarðgöng'!G52","v":0},{"$f":"'Niðurstöður - Jarðgöng'!H52","v":0}]
[null,{"$f":"'Niðurstöður - Jarðgöng'!B53","v":"45.68 Grjótsvelgur"},{"$f":"'Niðurstöður - Jarðgöng'!C53","v":0},{"$f":"'Niðurstöður - Jarðgöng'!D53","v":0},{"$f":"'Niðurstöður - Jarðgöng'!E53","v":0},{"$f":"'Niðurstöður - Jarðgöng'!F53","v":0},{"$f":"'Niðurstöður - Jarðgöng'!G53","v":0},{"$f":"'Niðurstöður - Jarðgöng'!H53","v":0}]
[null,{"$f":"'Niðurstöður - Jarðgöng'!B54","v":"45.1 + 45.8 Gröftur lagnaskurða og fylling í skurði"},{"$f":"'Niðurstöður - Jarðgöng'!C54","v":0},{"$f":"'Niðurstöður - Jarðgöng'!D54","v":0},{"$f":"'Niðurstöður - Jarðgöng'!E54","v":0},{"$f":"'Niðurstöður - Jarðgöng'!F54","v":0},{"$f":"'Niðurstöður - Jarðgöng'!G54","v":0},{"$f":"'Niðurstöður - Jarðgöng'!H54","v":0}]
[null,{"$f":"'Niðurstöður - Jarðgöng'!B55","v":"Rafstrengir"},{"$f":"'Niðurstöður - Jarðgöng'!C55","v":0},{"$f":"'Niðurstöður - Jarðgöng'!D55","v":0},{"$f":"'Niðurstöður - Jarðgöng'!E55","v":0},{"$f":"'Niðurstöður - Jarðgöng'!F55","v":0},{"$f":"'Niðurstöður - Jarðgöng'!G55","v":0},{"$f":"'Niðurstöður - Jarðgöng'!H55","v":0}]
[null,{"$f":"'Niðurstöður - Jarðgöng'!B56","v":"52.2 Styrktarlag"},{"$f":"'Niðurstöður - Jarðgöng'!C56","v":0},{"$f":"'Niðurstöður - Jarðgöng'!D56","v":0},{"$f":"'Niðurstöður - Jarðgöng'!E56","v":0},{"$f":"'Niðurstöður - Jarðgöng'!F56","v":0},{"$f":"'Niðurstöður - Jarðgöng'!G56","v":0},{"$f":"'Niðurstöður - Jarðgöng'!H56","v":0}]
[null,{"$f":"'Niðurstöður - Jarðgöng'!B57","v":"53.1 Óbundið burðarlag"},{"$f":"'Niðurstöður - Jarðgöng'!C57","v":0},{"$f":"'Niðurstöður - Jarðgöng'!D57","v":0},{"$f":"'Niðurstöður - Jarðgöng'!E57","v":0},{"$f":"'Niðurstöður - Jarðgöng'!F57","v":0},{"$f":"'Niðurstöður - Jarðgöng'!G57","v":0},{"$f":"'Niðurstöður - Jarðgöng'!H57","v":0}]
[null,{"$f":"'Niðurstöður - Jarðgöng'!B58","v":"63.42 Burðarlagsmalbik"},{"$f":"'Niðurstöður - Jarðgöng'!C58","v":0},{"$f":"'Niðurstöður - Jarðgöng'!D58","v":0},{"$f":"'Niðurstöður - Jarðgöng'!E58","v":0},{"$f":"'Niðurstöður - Jarðgöng'!F58","v":0},{"$f":"'Niðurstöður - Jarðgöng'!G58","v":0},{"$f":"'Niðurstöður - Jarðgöng'!H58","v":0}]
[null,{"$f":"'Niðurstöður - Jarðgöng'!B59","v":"63.43 Slitlagsmalbik"},{"$f":"'Niðurstöður - Jarðgöng'!C59","v":0},{"$f":"'Niðurstöður - Jarðgöng'!D59","v":0},{"$f":"'Niðurstöður - Jarðgöng'!E59","v":0},{"$f":"'Niðurstöður - Jarðgöng'!F59","v":0},{"$f":"'Niðurstöður - Jarðgöng'!G59","v":0},{"$f":"'Niðurstöður - Jarðgöng'!H59","v":0}]
[null,{"$f":"'Niðurstöður - Jarðgöng'!B60","v":"68.24 Steypt gangstétt"},{"$f":"'Niðurstöður - Jarðgöng'!C60","v":0},{"$f":"'Niðurstöður - Jarðgöng'!D60","v":0},{"$f":"'Niðurstöður - Jarðgöng'!E60","v":0},{"$f":"'Niðurstöður - Jarðgöng'!F60","v":0},{"$f":"'Niðurstöður - Jarðgöng'!G60","v":0},{"$f":"'Niðurstöður - Jarðgöng'!H60","v":0}]
[null,{"$f":"'Niðurstöður - Jarðgöng'!B61","v":"68.25 Gangstígar/eyjarhringtorg með hellum"},{"$f":"'Niðurstöður - Jarðgöng'!C61","v":0},{"$f":"'Niðurstöður - Jarðgöng'!D61","v":0},{"$f":"'Niðurstöður - Jarðgöng'!E61","v":0},{"$f":"'Niðurstöður - Jarðgöng'!F61","v":0},{"$f":"'Niðurstöður - Jarðgöng'!G61","v":0},{"$f":"'Niðurstöður - Jarðgöng'!H61","v":0}]
[null,{"$f":"'Niðurstöður - Jarðgöng'!B62","v":"75.1 Kantsteinar"},{"$f":"'Niðurstöður - Jarðgöng'!C62","v":0},{"$f":"'Niðurstöður - Jarðgöng'!D62","v":0},{"$f":"'Niðurstöður - Jarðgöng'!E62","v":0},{"$f":"'Niðurstöður - Jarðgöng'!F62","v":0},{"$f":"'Niðurstöður - Jarðgöng'!G62","v":0},{"$f":"'Niðurstöður - Jarðgöng'!H62","v":0}]
[null,{"$f":"'Niðurstöður - Jarðgöng'!B63","v":"75.2 Eyjar og hringtorg"},{"$f":"'Niðurstöður - Jarðgöng'!C63","v":0},{"$f":"'Niðurstöður - Jarðgöng'!D63","v":0},{"$f":"'Niðurstöður - Jarðgöng'!E63","v":0},{"$f":"'Niðurstöður - Jarðgöng'!F63","v":0},{"$f":"'Niðurstöður - Jarðgöng'!G63","v":0},{"$f":"'Niðurstöður - Jarðgöng'!H63","v":0}]
[null,{"$f":"'Niðurstöður - Jarðgöng'!B64","v":"75.6 Vegrið"},{"$f":"'Niðurstöður - Jarðgöng'!C64","v":0},{"$f":"'Niðurstöður - Jarðgöng'!D64","v":0},{"$f":"'Niðurstöður - Jarðgöng'!E64","v":0},{"$f":"'Niðurstöður - Jarðgöng'!F64","v":0},{"$f":"'Niðurstöður - Jarðgöng'!G64","v":0},{"$f":"'Niðurstöður - Jarðgöng'!H64","v":0}]
[null,{"$f":"'Niðurstöður - Jarðgöng'!B65","v":"76.45 Ljósastuarar"},{"$f":"'Niðurstöður - Jarðgöng'!C65","v":0},{"$f":"'Niðurstöður - Jarðgöng'!D65","v":0},{"$f":"'Niðurstöður - Jarðgöng'!E65","v":0},{"$f":"'Niðurstöður - Jarðgöng'!F65","v":0},{"$f":"'Niðurstöður - Jarðgöng'!G65","v":0},{"$f":"'Niðurstöður - Jarðgöng'!H65","v":0}]
[null,{"$f":"'Niðurstöður - Jarðgöng'!B66","v":"75.62 Vegrið á brú"},{"$f":"'Niðurstöður - Jarðgöng'!C66","v":0},{"$f":"'Niðurstöður - Jarðgöng'!D66","v":0},{"$f":"'Niðurstöður - Jarðgöng'!E66","v":0},{"$f":"'Niðurstöður - Jarðgöng'!F66","v":0},{"$f":"'Niðurstöður - Jarðgöng'!G66","v":0},{"$f":"'Niðurstöður - Jarðgöng'!H66","v":0}]
[null,{"$f":"'Niðurstöður - Jarðgöng'!B67","v":"75.7 Handrið"},{"$f":"'Niðurstöður - Jarðgöng'!C67","v":0},{"$f":"'Niðurstöður - Jarðgöng'!D67","v":0},{"$f":"'Niðurstöður - Jarðgöng'!E67","v":0},{"$f":"'Niðurstöður - Jarðgöng'!F67","v":0},{"$f":"'Niðurstöður - Jarðgöng'!G67","v":0},{"$f":"'Niðurstöður - Jarðgöng'!H67","v":0}]
[null,{"$f":"'Niðurstöður - Jarðgöng'!B68","v":"83.11 Bergboltar"},{"$f":"'Niðurstöður - Jarðgöng'!C68","v":0},{"$f":"'Niðurstöður - Jarðgöng'!D68","v":0},{"$f":"'Niðurstöður - Jarðgöng'!E68","v":0},{"$f":"'Niðurstöður - Jarðgöng'!F68","v":0},{"$f":"'Niðurstöður - Jarðgöng'!G68","v":0},{"$f":"'Niðurstöður - Jarðgöng'!H68","v":0}]
[null,{"$f":"'Niðurstöður - Jarðgöng'!B69","v":"83.212 Steyptir staurar"},{"$f":"'Niðurstöður - Jarðgöng'!C69","v":0},{"$f":"'Niðurstöður - Jarðgöng'!D69","v":0},{"$f":"'Niðurstöður - Jarðgöng'!E69","v":0},{"$f":"'Niðurstöður - Jarðgöng'!F69","v":0},{"$f":"'Niðurstöður - Jarðgöng'!G69","v":0},{"$f":"'Niðurstöður - Jarðgöng'!H69","v":0}]
[null,{"$f":"'Niðurstöður - Jarðgöng'!B70","v":"83.222 Tréstaurar"},{"$f":"'Niðurstöður - Jarðgöng'!C70","v":0},{"$f":"'Niðurstöður - Jarðgöng'!D70","v":0},{"$f":"'Niðurstöður - Jarðgöng'!E70","v":0},{"$f":"'Niðurstöður - Jarðgöng'!F70","v":0},{"$f":"'Niðurstöður - Jarðgöng'!G70","v":0},{"$f":"'Niðurstöður - Jarðgöng'!H70","v":0}]
[null,{"$f":"'Niðurstöður - Jarðgöng'!B71","v":"83.232 Stálstaurar"},{"$f":"'Niðurstöður - Jarðgöng'!C71","v":0},{"$f":"'Niðurstöður - Jarðgöng'!D71","v":0},{"$f":"'Niðurstöður - Jarðgöng'!E71","v":0},{"$f":"'Niðurstöður - Jarðgöng'!F71","v":0},{"$f":"'Niðurstöður - Jarðgöng'!G71","v":0},{"$f":"'Niðurstöður - Jarðgöng'!H71","v":0}]
[null,{"$f":"'Niðurstöður - Jarðgöng'!B72","v":"83.6 Stálþil"},{"$f":"'Niðurstöður - Jarðgöng'!C72","v":0},{"$f":"'Niðurstöður - Jarðgöng'!D72","v":0},{"$f":"'Niðurstöður - Jarðgöng'!E72","v":0},{"$f":"'Niðurstöður - Jarðgöng'!F72","v":0},{"$f":"'Niðurstöður - Jarðgöng'!G72","v":0},{"$f":"'Niðurstöður - Jarðgöng'!H72","v":0}]
[null,{"$f":"'Niðurstöður - Jarðgöng'!B73","v":"84.2 Mót"},{"$f":"'Niðurstöður - Jarðgöng'!C73","v":0},{"$f":"'Niðurstöður - Jarðgöng'!D73","v":0},{"$f":"'Niðurstöður - Jarðgöng'!E73","v":0},{"$f":"'Niðurstöður - Jarðgöng'!F73","v":0},{"$f":"'Niðurstöður - Jarðgöng'!G73","v":0},{"$f":"'Niðurstöður - Jarðgöng'!H73","v":0}]
[null,{"$f":"'Niðurstöður - Jarðgöng'!B74","v":"84.31 Slakbent járnalögn"},{"$f":"'Niðurstöður - Jarðgöng'!C74","v":0},{"$f":"'Niðurstöður - Jarðgöng'!D74","v":0},{"$f":"'Niðurstöður - Jarðgöng'!E74","v":0},{"$f":"'Niðurstöður - Jarðgöng'!F74","v":0},{"$f":"'Niðurstöður - Jarðgöng'!G74","v":0},{"$f":"'Niðurstöður - Jarðgöng'!H74","v":0}]
[null,{"$f":"'Niðurstöður - Jarðgöng'!B75","v":"84.36 Eftirspennt járnalögn"},{"$f":"'Niðurstöður - Jarðgöng'!C75","v":0},{"$f":"'Niðurstöður - Jarðgöng'!D75","v":0},{"$f":"'Niðurstöður - Jarðgöng'!E75","v":0},{"$f":"'Niðurstöður - Jarðgöng'!F75","v":0},{"$f":"'Niðurstöður - Jarðgöng'!G75","v":0},{"$f":"'Niðurstöður - Jarðgöng'!H75","v":0}]
[null,{"$f":"'Niðurstöður - Jarðgöng'!B76","v":"84.4 Steypa"},{"$f":"'Niðurstöður - Jarðgöng'!C76","v":0},{"$f":"'Niðurstöður - Jarðgöng'!D76","v":0},{"$f":"'Niðurstöður - Jarðgöng'!E76","v":0},{"$f":"'Niðurstöður - Jarðgöng'!F76","v":0},{"$f":"'Niðurstöður - Jarðgöng'!G76","v":0},{"$f":"'Niðurstöður - Jarðgöng'!H76","v":0}]
[null,{"$f":"'Niðurstöður - Jarðgöng'!B77","v":"84.57 Vatnsvarnalag undir malbiki"},{"$f":"'Niðurstöður - Jarðgöng'!C77","v":0},{"$f":"'Niðurstöður - Jarðgöng'!D77","v":0},{"$f":"'Niðurstöður - Jarðgöng'!E77","v":0},{"$f":"'Niðurstöður - Jarðgöng'!F77","v":0},{"$f":"'Niðurstöður - Jarðgöng'!G77","v":0},{"$f":"'Niðurstöður - Jarðgöng'!H77","v":0}]
[null,{"$f":"'Niðurstöður - Jarðgöng'!B78","v":"85.1 Stálvirki"},{"$f":"'Niðurstöður - Jarðgöng'!C78","v":0},{"$f":"'Niðurstöður - Jarðgöng'!D78","v":0},{"$f":"'Niðurstöður - Jarðgöng'!E78","v":0},{"$f":"'Niðurstöður - Jarðgöng'!F78","v":0},{"$f":"'Niðurstöður - Jarðgöng'!G78","v":0},{"$f":"'Niðurstöður - Jarðgöng'!H78","v":0}]
[null,{"$f":"'Niðurstöður - Jarðgöng'!B79","v":"86.1 Legur"},{"$f":"'Niðurstöður - Jarðgöng'!C79","v":0},{"$f":"'Niðurstöður - Jarðgöng'!D79","v":0},{"$f":"'Niðurstöður - Jarðgöng'!E79","v":0},{"$f":"'Niðurstöður - Jarðgöng'!F79","v":0},{"$f":"'Niðurstöður - Jarðgöng'!G79","v":0},{"$f":"'Niðurstöður - Jarðgöng'!H79","v":0}]
[null,{"$f":"'Niðurstöður - Jarðgöng'!B80","v":"86.4 Þensluraufar"},{"$f":"'Niðurstöður - Jarðgöng'!C80","v":0},{"$f":"'Niðurstöður - Jarðgöng'!D80","v":0},{"$f":"'Niðurstöður - Jarðgöng'!E80","v":0},{"$f":"'Niðurstöður - Jarðgöng'!F80","v":0},{"$f":"'Niðurstöður - Jarðgöng'!G80","v":0},{"$f":"'Niðurstöður - Jarðgöng'!H80","v":0}]
[null,{"$f":"'Niðurstöður - Jarðgöng'!B81","v":"22.51 Gröftur í göngum"},{"$f":"'Niðurstöður - Jarðgöng'!C81","v":0},{"$f":"'Niðurstöður - Jarðgöng'!D81","v":0},{"$f":"'Niðurstöður - Jarðgöng'!E81","v":0},{"$f":"'Niðurstöður - Jarðgöng'!F81","v":0},{"$f":"'Niðurstöður - Jarðgöng'!G81","v":0},{"$f":"'Niðurstöður - Jarðgöng'!H81","v":0}]
[null,{"$f":"'Niðurstöður - Jarðgöng'!B82","v":"23.2 Borun könnunar og bergþéttingarhola"},{"$f":"'Niðurstöður - Jarðgöng'!C82","v":0},{"$f":"'Niðurstöður - Jarðgöng'!D82","v":0},{"$f":"'Niðurstöður - Jarðgöng'!E82","v":0},{"$f":"'Niðurstöður - Jarðgöng'!F82","v":0},{"$f":"'Niðurstöður - Jarðgöng'!G82","v":0},{"$f":"'Niðurstöður - Jarðgöng'!H82","v":0}]
[null,{"$f":"'Niðurstöður - Jarðgöng'!B83","v":"23.6 Bergþétting með sementsefju"},{"$f":"'Niðurstöður - Jarðgöng'!C83","v":0},{"$f":"'Niðurstöður - Jarðgöng'!D83","v":0},{"$f":"'Niðurstöður - Jarðgöng'!E83","v":0},{"$f":"'Niðurstöður - Jarðgöng'!F83","v":0},{"$f":"'Niðurstöður - Jarðgöng'!G83","v":0},{"$f":"'Niðurstöður - Jarðgöng'!H83","v":0}]
[null,{"$f":"'Niðurstöður - Jarðgöng'!B84","v":"25.2 Bergboltar"},{"$f":"'Niðurstöður - Jarðgöng'!C84","v":0},{"$f":"'Niðurstöður - Jarðgöng'!D84","v":0},{"$f":"'Niðurstöður - Jarðgöng'!E84","v":0},{"$f":"'Niðurstöður - Jarðgöng'!F84","v":0},{"$f":"'Niðurstöður - Jarðgöng'!G84","v":0},{"$f":"'Niðurstöður - Jarðgöng'!H84","v":0}]
[null,{"$f":"'Niðurstöður - Jarðgöng'!B85","v":"25.4 Sprautusteypa"},{"$f":"'Niðurstöður - Jarðgöng'!C85","v":0},{"$f":"'Niðurstöður - Jarðgöng'!D85","v":0},{"$f":"'Niðurstöður - Jarðgöng'!E85","v":0},{"$f":"'Niðurstöður - Jarðgöng'!F85","v":0},{"$f":"'Niðurstöður - Jarðgöng'!G85","v":0},{"$f":"'Niðurstöður - Jarðgöng'!H85","v":0}]
[null,{"$f":"'Niðurstöður - Jarðgöng'!B86","v":"25.62 Járnalögn"},{"$f":"'Niðurstöður - Jarðgöng'!C86","v":0},{"$f":"'Niðurstöður - Jarðgöng'!D86","v":0},{"$f":"'Niðurstöður - Jarðgöng'!E86","v":0},{"$f":"'Niðurstöður - Jarðgöng'!F86","v":0},{"$f":"'Niðurstöður - Jarðgöng'!G86","v":0},{"$f":"'Niðurstöður - Jarðgöng'!H86","v":0}]
[null,{"$f":"'Niðurstöður - Jarðgöng'!B87","v":"26.3 Dúkur undir sprautusteypu"},{"$f":"'Niðurstöður - Jarðgöng'!C87","v":0},{"$f":"'Niðurstöður - Jarðgöng'!D87","v":0},{"$f":"'Niðurstöður - Jarðgöng'!E87","v":0},{"$f":"'Niðurstöður - Jarðgöng'!F87","v":0},{"$f":"'Niðurstöður - Jarðgöng'!G87","v":0},{"$f":"'Niðurstöður - Jarðgöng'!H87","v":0}]
[null,{"$f":"'Niðurstöður - Jarðgöng'!B88","v":"26.1 Einangrunarklæðing undir sprautusteypu"},{"$f":"'Niðurstöður - Jarðgöng'!C88","v":0},{"$f":"'Niðurstöður - Jarðgöng'!D88","v":0},{"$f":"'Niðurstöður - Jarðgöng'!E88","v":0},{"$f":"'Niðurstöður - Jarðgöng'!F88","v":0},{"$f":"'Niðurstöður - Jarðgöng'!G88","v":0},{"$f":"'Niðurstöður - Jarðgöng'!H88","v":0}]
[null,null,null,{"$f":"SUM(D203:D252)","v":0}]
[]
[null,{"$f":"'Niðurstöður - Gönguleiðir'!B34","v":"32.1 Bergskeringar í vegstæði"},{"$f":"'Niðurstöður - Gönguleiðir'!C34","v":0},{"$f":"'Niðurstöður - Gönguleiðir'!D34","v":0},{"$f":"'Niðurstöður - Gönguleiðir'!E34","v":0},{"$f":"'Niðurstöður - Gönguleiðir'!F34","v":0},{"$f":"'Niðurstöður - Gönguleiðir'!G34","v":0},{"$f":"'Niðurstöður - Gönguleiðir'!H34","v":0}]
[null,{"$f":"'Niðurstöður - Gönguleiðir'!B35","v":"32.2 Bergskeringar í námu"},{"$f":"'Niðurstöður - Gönguleiðir'!C35","v":0},{"$f":"'Niðurstöður - Gönguleiðir'!D35","v":0},{"$f":"'Niðurstöður - Gönguleiðir'!E35","v":0},{"$f":"'Niðurstöður - Gönguleiðir'!F35","v":0},{"$f":"'Niðurstöður - Gönguleiðir'!G35","v":0},{"$f":"'Niðurstöður - Gönguleiðir'!H35","v":0}]
[null,{"$f":"'Niðurstöður - Gönguleiðir'!B36","v":"33.1 Fyllingarefni úr skeringum"},{"$f":"'Niðurstöður - Gönguleiðir'!C36","v":0},{"$f":"'Niðurstöður - Gönguleiðir'!D36","v":0},{"$f":"'Niðurstöður - Gönguleiðir'!E36","v":0},{"$f":"'Niðurstöður - Gönguleiðir'!F36","v":0},{"$f":"'Niðurstöður - Gönguleiðir'!G36","v":0},{"$f":"'Niðurstöður - Gönguleiðir'!H36","v":0}]
[null,{"$f":"'Niðurstöður - Gönguleiðir'!B37","v":"33.2 Fyllingarefni úr námu"},{"$f":"'Niðurstöður - Gönguleiðir'!C37","v":0},{"$f":"'Niðurstöður - Gönguleiðir'!D37","v":0},{"$f":"'Niðurstöður - Gönguleiðir'!E37","v":0},{"$f":"'Niðurstöður - Gönguleiðir'!F37","v":0},{"$f":"'Niðurstöður - Gönguleiðir'!G37","v":0},{"$f":"'Niðurstöður - Gönguleiðir'!H37","v":0}]
[null,{"$f":"'Niðurstöður - Gönguleiðir'!B38","v":"34.1 Fláafleygar, efni úr skeringum"},{"$f":"'Niðurstöður - Gönguleiðir'!C38","v":0},{"$f":"'Niðurstöður - Gönguleiðir'!D38","v":0},{"$f":"'Niðurstöður - Gönguleiðir'!E38","v":0},{"$f":"'Niðurstöður - Gönguleiðir'!F38","v":0},{"$f":"'Niðurstöður - Gönguleiðir'!G38","v":0},{"$f":"'Niðurstöður - Gönguleiðir'!H38","v":0}]
[null,{"$f":"'Niðurstöður - Gönguleiðir'!B39","v":"34.8 Ónothæfu efni jafnað á losunarstað"},{"$f":"'Niðurstöður - Gönguleiðir'!C39","v":0},{"$f":"'Niðurstöður - Gönguleiðir'!D39","v":0},{"$f":"'Niðurstöður - Gönguleiðir'!E39","v":0},{"$f":"'Niðurstöður - Gönguleiðir'!F39","v":0},{"$f":"'Niðurstöður - Gönguleiðir'!G39","v":0},{"$f":"'Niðurstöður - Gönguleiðir'!H39","v":0}]
[null,{"$f":"'Niðurstöður - Gönguleiðir'!B40","v":"36.2 Grjótvörn"},{"$f":"'Niðurstöður - Gönguleiðir'!C40","v":0},{"$f":"'Niðurstöður - Gönguleiðir'!D40","v":0},{"$f":"'Niðurstöður - Gönguleiðir'!E40","v":0},{"$f":"'Niðurstöður - Gönguleiðir'!F40","v":0},{"$f":"'Niðurstöður - Gönguleiðir'!G40","v":0},{"$f":"'Niðurstöður - Gönguleiðir'!H40","v":0}]
[null,{"$f":"'Niðurstöður - Gönguleiðir'!B41","v":"45.71 Plaströr, vatnsveita"},{"$f":"'Niðurstöður - Gönguleiðir'!C41","v":0},{"$f":"'Niðurstöður - Gönguleiðir'!D41","v":0},{"$f":"'Niðurstöður - Gönguleiðir'!E41","v":0},{"$f":"'Niðurstöður - Gönguleiðir'!F41","v":0},{"$f":"'Niðurstöður - Gönguleiðir'!G41","v":0},{"$f":"'Niðurstöður - Gönguleiðir'!H41","v":0}]
[null,{"$f":"'Niðurstöður - Gönguleiðir'!B42","v":"42.3 Plaströr, fráveita"},{"$f":"'Niðurstöður - Gönguleiðir'!C42","v":0},{"$f":"'Niðurstöður - Gönguleiðir'!D42","v":0},{"$f":"'Niðurstöður - Gönguleiðir'!E42","v":0},{"$f":"'Niðurstöður - Gönguleiðir'!F42","v":0},{"$f":"'Niðurstöður - Gönguleiðir'!G42","v":0},{"$f":"'Niðurstöður - Gönguleiðir'!H42","v":0}]
[null,{"$f":"'Niðurstöður - Gönguleiðir'!B43","v":"45.72 Hitaveiturör"},{"$f":"'Niðurstöður - Gönguleiðir'!C43","v":0},{"$f":"'Niðurstöður - Gönguleiðir'!D43","v":0},{"$f":"'Niðurstöður - Gönguleiðir'!E43","v":0},{"$f":"'Niðurstöður - Gönguleiðir'!F43","v":0},{"$f":"'Niðurstöður - Gönguleiðir'!G43","v":0},{"$f":"'Niðurstöður - Gönguleiðir'!H43","v":0}]
[null,{"$f":"'Niðurstöður - Gönguleiðir'!B44","v":"42.4 Stálrör í ræsi"},{"$f":"'Niðurstöður - Gönguleiðir'!C44","v":0},{"$f":"'Niðurstöður - Gönguleiðir'!D44","v":0},{"$f":"'Niðurstöður - Gönguleiðir'!E44","v":0},{"$f":"'Niðurstöður - Gönguleiðir'!F44","v":0},{"$f":"'Niðurstöður - Gönguleiðir'!G44","v":0},{"$f":"'Niðurstöður - Gönguleiðir'!H44","v":0}]
[null,{"$f":"'Niðurstöður - Gönguleiðir'!B45","v":"45.4 Steypt ofanvatnsræsi"},{"$f":"'Niðurstöður - Gönguleiðir'!C45","v":0},{"$f":"'Niðurstöður - Gönguleiðir'!D45","v":0},{"$f":"'Niðurstöður - Gönguleiðir'!E45","v":0},{"$f":"'Niðurstöður - Gönguleiðir'!F45","v":0},{"$f":"'Niðurstöður - Gönguleiðir'!G45","v":0},{"$f":"'Niðurstöður - Gönguleiðir'!H45","v":0}]
[null,{"$f":"'Niðurstöður - Gönguleiðir'!B46","v":"45.5 Brunnar"},{"$f":"'Niðurstöður - Gönguleiðir'!C46","v":0},{"$f":"'Niðurstöður - Gönguleiðir'!D46","v":0},{"$f":"'Niðurstöður - Gönguleiðir'!E46","v":0},{"$f":"'Niðurstöður - Gönguleiðir'!F46","v":0},{"$f":"'Niðurstöður - Gönguleiðir'!G46","v":0},{"$f":"'Niðurstöður - Gönguleiðir'!H46","v":0}]
[null,{"$f":"'Niðurstöður - Gönguleiðir'!B47","v":"45.6 Niðurföll / sandfang"},{"$f":"'Niðurstöður - Gönguleiðir'!C47","v":0},{"$f":"'Niðurstöður - Gönguleiðir'!D47","v":0},{"$f":"'Niðurstöður - Gönguleiðir'!E47","v":0},{"$f":"'Niðurstöður - Gönguleiðir'!F47","v":0},{"$f":"'Niðurstöður - Gönguleiðir'!G47","v":0},{"$f":"'Niðurstöður - Gönguleiðir'!H47","v":0}]
[null,{"$f":"'Niðurstöður - Gönguleiðir'!B48","v":"45.68 Grjótsvelgur"},{"$f":"'Niðurstöður - Gönguleiðir'!C48","v":0},{"$f":"'Niðurstöður - Gönguleiðir'!D48","v":0},{"$f":"'Niðurstöður - Gönguleiðir'!E48","v":0},{"$f":"'Niðurstöður - Gönguleiðir'!F48","v":0},{"$f":"'Niðurstöður - Gönguleiðir'!G48","v":0},{"$f":"'Niðurstöður - Gönguleiðir'!H48","v":0}]
[null,{"$f":"'Niðurstöður - Gönguleiðir'!B49","v":"45.1 + 45.8 Gröftur lagnaskurða og fylling í skurði"},{"$f":"'Niðurstöður - Gönguleiðir'!C49","v":0},{"$f":"'Niðurstöður - Gönguleiðir'!D49","v":0},{"$f":"'Niðurstöður - Gönguleiðir'!E49","v":0},{"$f":"'Niðurstöður - Gönguleiðir'!F49","v":0},{"$f":"'Niðurstöður - Gönguleiðir'!G49","v":0},{"$f":"'Niðurstöður - Gönguleiðir'!H49","v":0}]
[null,{"$f":"'Niðurstöður - Gönguleiðir'!B50","v":"Rafstrengir"},{"$f":"'Niðurstöður - Gönguleiðir'!C50","v":0},{"$f":"'Niðurstöður - Gönguleiðir'!D50","v":0},{"$f":"'Niðurstöður - Gönguleiðir'!E50","v":0},{"$f":"'Niðurstöður - Gönguleiðir'!F50","v":0},{"$f":"'Niðurstöður - Gönguleiðir'!G50","v":0},{"$f":"'Niðurstöður - Gönguleiðir'!H50","v":0}]
[null,{"$f":"'Niðurstöður - Gönguleiðir'!B51","v":"52.2 Styrktarlag"},{"$f":"'Niðurstöður - Gönguleiðir'!C51","v":0},{"$f":"'Niðurstöður - Gönguleiðir'!D51","v":0},{"$f":"'Niðurstöður - Gönguleiðir'!E51","v":0},{"$f":"'Niðurstöður - Gönguleiðir'!F51","v":0},{"$f":"'Niðurstöður - Gönguleiðir'!G51","v":0},{"$f":"'Niðurstöður - Gönguleiðir'!H51","v":0}]
[null,{"$f":"'Niðurstöður - Gönguleiðir'!B52","v":"53.1 Óbundið burðarlag"},{"$f":"'Niðurstöður - Gönguleiðir'!C52","v":0},{"$f":"'Niðurstöður - Gönguleiðir'!D52","v":0},{"$f":"'Niðurstöður - Gönguleiðir'!E52","v":0},{"$f":"'Niðurstöður - Gönguleiðir'!F52","v":0},{"$f":"'Niðurstöður - Gönguleiðir'!G52","v":0},{"$f":"'Niðurstöður - Gönguleiðir'!H52","v":0}]
[null,{"$f":"'Niðurstöður - Gönguleiðir'!B53","v":"63.42 Burðarlagsmalbik"},{"$f":"'Niðurstöður - Gönguleiðir'!C53","v":0},{"$f":"'Niðurstöður - Gönguleiðir'!D53","v":0},{"$f":"'Niðurstöður - Gönguleiðir'!E53","v":0},{"$f":"'Niðurstöður - Gönguleiðir'!F53","v":0},{"$f":"'Niðurstöður - Gönguleiðir'!G53","v":0},{"$f":"'Niðurstöður - Gönguleiðir'!H53","v":0}]
[null,{"$f":"'Niðurstöður - Gönguleiðir'!B54","v":"63.43 Slitlagsmalbik"},{"$f":"'Niðurstöður - Gönguleiðir'!C54","v":0},{"$f":"'Niðurstöður - Gönguleiðir'!D54","v":0},{"$f":"'Niðurstöður - Gönguleiðir'!E54","v":0},{"$f":"'Niðurstöður - Gönguleiðir'!F54","v":0},{"$f":"'Niðurstöður - Gönguleiðir'!G54","v":0},{"$f":"'Niðurstöður - Gönguleiðir'!H54","v":0}]
[null,{"$f":"'Niðurstöður - Gönguleiðir'!B55","v":"68.24 Steypt gangstétt"},{"$f":"'Niðurstöður - Gönguleiðir'!C55","v":0},{"$f":"'Niðurstöður - Gönguleiðir'!D55","v":0},{"$f":"'Niðurstöður - Gönguleiðir'!E55","v":0},{"$f":"'Niðurstöður - Gönguleiðir'!F55","v":0},{"$f":"'Niðurstöður - Gönguleiðir'!G55","v":0},{"$f":"'Niðurstöður - Gönguleiðir'!H55","v":0}]
[null,{"$f":"'Niðurstöður - Gönguleiðir'!B56","v":"68.25 Gangstígar/eyjarhringtorg með hellum"},{"$f":"'Niðurstöður - Gönguleiðir'!C56","v":0},{"$f":"'Niðurstöður - Gönguleiðir'!D56","v":0},{"$f":"'Niðurstöður - Gönguleiðir'!E56","v":0},{"$f":"'Niðurstöður - Gönguleiðir'!F56","v":0},{"$f":"'Niðurstöður - Gönguleiðir'!G56","v":0},{"$f":"'Niðurstöður - Gönguleiðir'!H56","v":0}]
[null,{"$f":"'Niðurstöður - Gönguleiðir'!B57","v":"75.1 Kantsteinar"},{"$f":"'Niðurstöður - Gönguleiðir'!C57","v":0},{"$f":"'Niðurstöður - Gönguleiðir'!D57","v":0},{"$f":"'Niðurstöður - Gönguleiðir'!E57","v":0},{"$f":"'Niðurstöður - Gönguleiðir'!F57","v":0},{"$f":"'Niðurstöður - Gönguleiðir'!G57","v":0},{"$f":"'Niðurstöður - Gönguleiðir'!H57","v":0}]
[null,{"$f":"'Niðurstöður - Gönguleiðir'!B58","v":"75.2 Eyjar og hringtorg"},{"$f":"'Niðurstöður - Gönguleiðir'!C58","v":0},{"$f":"'Niðurstöður - Gönguleiðir'!D58","v":0},{"$f":"'Niðurstöður - Gönguleiðir'!E58","v":0},{"$f":"'Niðurstöður - Gönguleiðir'!F58","v":0},{"$f":"'Niðurstöður - Gönguleiðir'!G58","v":0},{"$f":"'Niðurstöður - Gönguleiðir'!H58","v":0}]
[null,{"$f":"'Niðurstöður - Gönguleiðir'!B59","v":"75.6 Vegrið"},{"$f":"'Niðurstöður - Gönguleiðir'!C59","v":0},{"$f":"'Niðurstöður - Gönguleiðir'!D59","v":0},{"$f":"'Niðurstöður - Gönguleiðir'!E59","v":0},{"$f":"'Niðurstöður - Gönguleiðir'!F59","v":0},{"$f":"'Niðurstöður - Gönguleiðir'!G59","v":0},{"$f":"'Niðurstöður - Gönguleiðir'!H59","v":0}]
[null,{"$f":"'Niðurstöður - Gönguleiðir'!B60","v":"76.45 Ljósastuarar"},{"$f":"'Niðurstöður - Gönguleiðir'!C60","v":0},{"$f":"'Niðurstöður - Gönguleiðir'!D60","v":0},{"$f":"'Niðurstöður - Gönguleiðir'!E60","v":0},{"$f":"'Niðurstöður - Gönguleiðir'!F60","v":0},{"$f":"'Niðurstöður - Gönguleiðir'!G60","v":0},{"$f":"'Niðurstöður - Gönguleiðir'!H60","v":0}]
[null,{"$f":"'Niðurstöður - Gönguleiðir'!B61","v":"75.62 Vegrið á brú"},{"$f":"'Niðurstöður - Gönguleiðir'!C61","v":0},{"$f":"'Niðurstöður - Gönguleiðir'!D61","v":0},{"$f":"'Niðurstöður - Gönguleiðir'!E61","v":0},{"$f":"'Niðurstöður - Gönguleiðir'!F61","v":0},{"$f":"'Niðurstöður - Gönguleiðir'!G61","v":0},{"$f":"'Niðurstöður - Gönguleiðir'!H61","v":0}]
[null,{"$f":"'Niðurstöður - Gönguleiðir'!B62","v":"75.7 Handrið"},{"$f":"'Niðurstöður - Gönguleiðir'!C62","v":0},{"$f":"'Niðurstöður - Gönguleiðir'!D62","v":0},{"$f":"'Niðurstöður - Gönguleiðir'!E62","v":0},{"$f":"'Niðurstöður - Gönguleiðir'!F62","v":0},{"$f":"'Niðurstöður - Gönguleiðir'!G62","v":0},{"$f":"'Niðurstöður - Gönguleiðir'!H62","v":0}]
[null,null,null,{"$f":"SUM(D255:D283)","v":0}]
[]
[null,null,null,{"$f":"D284+D201+D253+D162","v":0}]

{"sheet":"Reiknistuðlar","index":12,"n_rows":134,"n_cols":9,"rows_kept":134,"cut":false,"hidden":false,"merged":[]}
[]
[null,null,"Eining","Tákn","Notað gildi","Sjálfgefið gildi","Yfirskrifað gildi","Lýsing","Heimild"]
[null,"Rúmþyngdir"]
[null,"Steypa","kg/m3","mpV_steypa",{"$f":"IF(G4<>\"\",G4,F4)","v":2400},2400,null,"Rúmþyngd steypu","The Engineering Toolbox"]
[null,"Timbur","kg/m3","mpV_timbur",{"$f":"IF(G5<>\"\",G5,F5)","v":500},500,null,"Rúmþyngd timburs","The Engineering Toolbox"]
[null,"Grjót í grjótvarnir","t/m3","mpV_grjot",1.8,1.8,null,"Rúmþyngd grjóts í grjótvarnir","Íslenskt viðmið"]
[null,"Fast berg","t/m3 fast berg","mpV_fb",2.8,2.8,null,"Rúmþyngd fasts bergs","Íslenskt viðmið"]
[null,"Malbik","kg/m3","mpV_malb",2600,2600,null,"Rúmþyngd malbiks","EFLA"]
[null,"Steyptar hellur","kg/m3","mpV_hellur",2150,2150,null,"Rúmþyngd steyptra hellna","The Engineering Toolbox"]
[null,"Þyngdir á fermetra"]
[null,"Klæðing","kg/m2","mpA_klaeding",{"$f":"IF(G11<>\"\",G11,F11)","v":56.5},56.5,null,"Massi klæðingar á fermetra","Lífsferilsgreining fyrir veg, EFLA 2013"]
[null,"Trefjadúkur","kg/m2","mpA_duk",{"$f":"IF(G12<>\"\",G12,F12)","v":0.3},0.3,null,"Massi trefjadúks á fermetra","VegLCA"]
[null,"Stálþil","kg/m2","mpA_stalthil",{"$f":"IF(G13<>\"\",G13,F13)","v":150},150,null,"Massi stálþils á fermetra","Þyngd miðar við flatarþyngd og stífingar algengra prófíla frá Arcelor Mittal"]
[null,"Vatnsvarnarlag","kg/m2","mpA_vatnsv",6.5,6.5,null,"Massi vatnsvarnarlags á fermetra","https://eurotema.se/produkter/yep6500/"]
[null,"Einangrunarklæðing","kg/m2","mpA_einangr",1.571,1.571,null,"Massi einangrunarklæðingar á fermetra","NEPD-2915-1608-EN"]
[null,"Dúkur undir sprautusteypu","kg/m2","mpA_dukur",1.44,1.44,null,"Massi dúks undir sprautusteypu á fermetra","NEPD-5391-4699-EN"]
[null,"Þyngdir/rúmmál á lengdarmetra"]
[null,"Plaströr, D = 0,4 m","kg/m","mpl_Pror_04",{"$f":"IF(G18<>\"\",G18,F18)","v":11.82},11.82,null,"Massi plaströrs á lengdarmetra, þvermál 0,4 m","VegLCA"]
[null,"Plaströr, D = 0,5 m","kg/m","mpl_Pror_05",{"$f":"IF(G19<>\"\",G19,F19)","v":18.54},18.54,null,"Massi plaströrs á lengdarmetra, þvermál 0,5 m","VegLCA"]
[null,"Plaströr, D = 0,6 m","kg/m","mpl_Pror_06",25,25,null,"Massi plaströrs á lengdarmetra, þvermál 0,6 m","VegLCA"]
[null,"Plaströr, D = 0,8 m","kg/m","mpl_Pror_08",47.3,47.3,null,"Massi plaströrs á lengdarmetra, þvermál 0,8 m","VegLCA"]
[null,"Plaströr, D = 1,0 m","kg/m","mpl_Pror_10",73.900000000000006,73.900000000000006,null,"Massi plaströrs á lengdarmetra, þvermál 1,0 m","VegLCA"]
[null,"Plaströr, D = 1,2 m","kg/m","mpl_Pror_12",106.4,106.4,null,"Massi plaströrs á lengdarmetra, þvermál 1,2 m","VegLCA"]
[null,"Plaströr, D = 1,4 m","kg/m","mpl_Pror_14",145.43623837580003,145.43623837580003,null,"Massi plaströrs á lengdarmetra, þvermál 1,4 m","VegLCA"]
[]
[null,"PE plaströr, D = 63 - 200 mm","kg/m","mpl_VVror_02",3.5,3.5,null,"Massi PE rörs fyrir vatnsveitu á lengdarmetra, D = 63 - 200 mm","Vörubæklingur SET, vatnsveitur"]
[null,"PE plaströr, D = 201 - 400  mm","kg/m","mpl_VVror_04",17.600000000000001,17.600000000000001,null,"Massi PE rörs fyrir vatnsveitu á lengdarmetra, D = 201 - 400 mm","Vörubæklingur SET, vatnsveitur"]
[null,"PE plaströr, D = 401 - 600  mm","kg/m","mpl_VVror_06",44.2,44.2,null,"Massi PE rörs fyrir vatnsveitu á lengdarmetra, D = 401 - 600 mm","Vörubæklingur SET, vatnsveitur"]
[null,"PE plaströr, D = 601 - 800  mm","kg/m","mpl_VVror_08",89,89,null,"Massi PE rörs fyrir vatnsveitu á lengdarmetra, D = 601 - 800 mm","Vörubæklingur SET, vatnsveitur"]
[null,"PE plaströr, D = 801 - 1000  mm","kg/m","mpl_VVror_10",143,143,null,"Massi PE rörs fyrir vatnsveitu á lengdarmetra, D = 801 - 1000 mm","Vörubæklingur SET, vatnsveitur"]
[null,"PE plaströr, D = 1001 - 1200  mm","kg/m","mpl_VVror_12",214,214,null,"Massi PE rörs fyrir vatnsveitu á lengdarmetra, D = 1001 - 1200 mm","Vörubæklingur SET, vatnsveitur"]
[]
[null,"Fráveiturör, D = 250 - 400 mm","kg/m","mpl_FVror_04",6.85,6.85,null,"Massi X-Stream rörs fyrir fráveitu á lengdarmetra, D = 250 - 400 mm","Vörubæklingur SET, fráveitur, X-Stream"]
[null,"Fráveiturör, D = 401 - 600 mm","kg/m","mpl_FVror_06",14.55,14.55,null,"Massi X-Stream rörs fyrir fráveitu á lengdarmetra, D = 401 - 600 mm","Vörubæklingur SET, fráveitur, X-Stream"]
[null,"Fráveiturör, D = 601 - 800 mm","kg/m","mpl_FVror_08",26.5,26.5,null,"Massi X-Stream rörs fyrir fráveitu á lengdarmetra, D = 601 - 800 mm","Vörubæklingur SET, fráveitur, X-Stream"]
[null,"Fráveiturör, D = 801 - 1000 mm","kg/m","mpl_FVror_10",53.95,53.95,null,"Massi Weholite rörs fyrir fráveitu á lengdarmetra, D = 801 - 1000 mm","Vörubæklingur SET, fráveitur, Weholite"]
[null,"Fráveiturör, D = 1001 - 1400 mm","kg/m","mpl_FVror_14",94.4,94.4,null,"Massi Weholite rörs fyrir fráveitu á lengdarmetra, D = 1001 - 1400 mm","Vörubæklingur SET, fráveitur, Weholite"]
[null,"Fráveiturör, D = 1401 - 1800 mm","kg/m","mpl_FVror_18",167.4,167.4,null,"Massi Weholite rörs fyrir fráveitu á lengdarmetra, D = 1401 - 1800 mm","Vörubæklingur SET, fráveitur, Weholite"]
[null,"Fráveiturör, D = 1801 - 2200 mm","kg/m","mpl_FVror_22",261.10000000000002,261.10000000000002,null,"Massi Weholite rörs fyrir fráveitu á lengdarmetra, D = 1801 - 2200 mm","Vörubæklingur SET, fráveitur, Weholite"]
[null,"Fráveiturör, D > 2200 mm","kg/m","mpl_FVror_22p",407.3,407.3,null,"Massi Weholite rörs fyrir fráveitu á lengdarmetra, D > 2200 mm","Vörubæklingur SET, fráveitur, Weholite"]
[]
[null,"Hitaveiturör, D = 250 mm","kg/m","mpl_HVror_025",43.633333333333333,{"$f":"523.6/12","v":43.633333333333333},null,"Massi einangraðs stálrörs fyrir hitaveitu á lengdarmetra, D = 250 ","Vörubæklingur SET, hitaveitur, stálrör einangrunarflokkur 1"]
[null,"Hitaveiturör, D = 300 mm","kg/m","mpl_HVror_03",56.458333333333336,{"$f":"677.5/12","v":56.458333333333336},null,"Massi einangraðs stálrörs fyrir hitaveitu á lengdarmetra, D = 300","Vörubæklingur SET, hitaveitur, stálrör einangrunarflokkur 2"]
[null,"Hitaveiturör, D = 350 mm","kg/m","mpl_HVror_035",63.716666666666669,{"$f":"764.6/12","v":63.716666666666669},null,"Massi einangraðs stálrörs fyrir hitaveitu á lengdarmetra, D = 350","Vörubæklingur SET, hitaveitur, stálrör einangrunarflokkur 3"]
[null,"Hitaveiturör, D = 400 mm","kg/m","mpl_HVror_04",80.63333333333334,{"$f":"967.6/12","v":80.63333333333334},null,"Massi einangraðs stálrörs fyrir hitaveitu á lengdarmetra, D = 400","Vörubæklingur SET, hitaveitur, stálrör einangrunarflokkur 4"]
[null,"Hitaveiturör, D = 450 mm","kg/m","mpl_HVror_045",93.166666666666671,{"$f":"1118/12","v":93.166666666666671},null,"Massi einangraðs stálrörs fyrir hitaveituá lengdarmetra, D = 450","Vörubæklingur SET, hitaveitur, stálrör einangrunarflokkur 5"]
[null,"Hitaveiturör, D = 500 mm","kg/m","mpl_HVror_05",107.33333333333333,{"$f":"1288/12","v":107.33333333333333},null,"Massi einangraðs stálrörs fyrir hitaveitu  á lengdarmetra, D = 500","Vörubæklingur SET, hitaveitur, stálrör einangrunarflokkur 2"]
[null,"Hitaveiturör, D = 600 mm","kg/m","mpl_HVror_06",139.61666666666667,{"$f":"1675.4/12","v":139.61666666666667},null,"Massi einangraðs stálrörs fyrir hitaveitu  á lengdarmetra, D = 600","Vörubæklingur SET, hitaveitur, stálrör einangrunarflokkur 2"]
[null,"Hitaveiturör, D = 700 mm","kg/m","mpl_HVror_07",179.16666666666666,{"$f":"2150/12","v":179.16666666666666},null,"Massi einangraðs stálrörs fyrir hitaveitu  á lengdarmetra, D = 700","Vörubæklingur SET, hitaveitur, stálrör einangrunarflokkur 2"]
[null,"Hitaveiturör, D = 800 mm","kg/m","mpl_HVror_08",221.45833333333334,{"$f":"2657.5/12","v":221.45833333333334},null,"Massi einangraðs stálrörs fyrir hitaveitu  á lengdarmetra, D = 800","Vörubæklingur SET, hitaveitur, stálrör einangrunarflokkur 2"]
[]
[null,"Steypt rör, D < 120 mm","kg/m","mpl_Stror_120",34,34,null,"Massi steypts rörs  á lengdarmetra, þvermál < 120 mm","VegLCA"]
[null,"Steypt rör, D = 120 - 300 mm ","kg/m","mpl_Stror_300",130,130,null,"Massi steypts rörs  á lengdarmetra, þvermál 120 - 300 mm","VegLCA"]
[null,"Steypt rör, D = 301 - 600 mm","kg/m","mpl_Stror_600",420,420,null,"Massi steypts rörs  á lengdarmetra, þvermál 301 - 600 mm","VegLCA"]
[null,"Steypt rör, D = 601 - 1000 mm","kg/m","mpl_Stror_1000",790,790,null,"Massi steypts rörs  á lengdarmetra, þvermál 601 - 1000 mm","VegLCA"]
[null,"Steypt rör, D > 1000 mm","kg/m","mpl_Stror_1000p",1860,1860,null,"Massi steypts rörs  á lengdarmetra, þvermál > 1000 mm","VegLCA"]
[]
[null,"Stálrör, D = 0,3 m","kg/m","mpl_Stalror_03",15,15,null,"Massi stálrörs á lengdarmetra, þvermál 0,3 m","AIL Kanada"]
[null,"Stálrör, D = 0,6 m","kg/m","mpl_Stalror_06",28,28,null,"Massi stálrörs  á lengdarmetra, þvermál 0,6 m","AIL Kanada"]
[null,"Stálrör, D = 0,8 m","kg/m","mpl_Stalror_08",47,47,null,"Massi stálrörs  á lengdarmetra, þvermál 0,8 m","AIL Kanada"]
[null,"Stálrör, D = 1,0 m","kg/m","mpl_Stalror_10",58,58,null,"Massi stálrörs  á lengdarmetra, þvermál 1,0 m","AIL Kanada"]
[null,"Stálrör, D = 1,2 m","kg/m","mpl_Stalror_12",97,97,null,"Massi stálrörs  á lengdarmetra, þvermál 1,2 m","AIL Kanada"]
[null,"Stálrör, D = 1,6 m","kg/m","mpl_Stalror_16",132,132,null,"Massi stálrörs  á lengdarmetra, þvermál 1,6 m","AIL Kanada"]
[null,"Stálrör, D = 2,0 m","kg/m","mpl_Stalror_20",165,165,null,"Massi stálrörs  á lengdarmetra, þvermál 2,0 m","AIL Kanada"]
[null,"Stálrör, D >= 3,0 m","kg/m","mpl_Stalror_30",306,306,null,"Massi stálrörs  á lengdarmetra, þvermál >= 3,0 m","AIL Kanada"]
[]
[null,"Brunnupphækkun, D = 600 mm","kg/m","mpl_BrUp_06",13.3,13.3,null,"Massi 600 mm brunnupphækkunar á lengdarmetra","Vörubæklingur SET, Fráveitur"]
[null,"Brunnupphækkun, D = 1000 mm","kg/m","mpl_BrUp_10",30.3,30.3,null,"Massi 1000 mm brunnupphækkunar á lengdarmetra","Vörubæklingur SET, Fráveitur"]
[]
[null,"Kantsteinn 20 cm, járnalögn á lengdarmetra","kg/m","mpl_kant_stal_20",0.8,0.8,null,"Massi járnalagnar á lengdarmetra í 20 cm háum kantsteini","Stöðluð kantsteinsútfærsla"]
[null,"Kantsteinn 15 cm, járnalögn á lengdarmetra","kg/m","mpl_kant_stal_15",0.7,0.7,null,"Massi járnalagnar á lengdarmetra í 15 cm háum kantsteini","Stöðluð kantsteinsútfærsla"]
[null,"Kantsteinn 10 cm, járnalögn á lengdarmetra","kg/m","mpl_kant_stal_10",0.65,0.65,null,"Massi járnalagnar á lengdarmetra í 10 cm háum kantsteini","Stöðluð kantsteinsútfærsla"]
[null,"Kantsteinn 20 cm, steypa á lengdarmetra","m3/m","Vpl_kant_st_20",0.03,0.03,null,"Rúmmal steypu á lengdarmetra í 20 cm háum kantsteini","Stöðluð kantsteinsútfærsla"]
[null,"Kantsteinn 15 cm, steypa á lengdarmetra","m3/m","Vpl_kant_st_15",0.02,0.02,null,"Rúmmal steypu á lengdarmetra í 15 cm háum kantsteini","Stöðluð kantsteinsútfærsla"]
[null,"Kantsteinn 10 cm, steypa á lengdarmetra","m3/m","Vpl_kant_st_10",1.2E-2,1.2E-2,null,"Rúmmal steypu á lengdarmetra í 10 cm háum kantsteini","Stöðluð kantsteinsútfærsla"]
[]
[null,"Bitavegrið, stál","kg/m","mpl_bvegr",17,17,null,"Massi bitavegriðs á lengdarmetra","Stöðluð vegriðsútfærsla, t.d. frá Vik Ørsta"]
[null,"Röravegrið, stál","kg/m","mpl_rvegr",17,17,null,"Massi röravegriðs á lengdarmetra","Stöðluð vegriðsútfærsla, t.d. frá Vik Ørsta"]
[null,"Röravegrið á brú","kg/m","mpl_rvegr_bru",60,60,null,"Massi röravegriðs á brú á lengdarmetra","Stöðluð vegriðsútfærsla, t.d. Sicuro frá Vik Ørsta"]
[null,"Víravegrið, stál á lengdarmetra","kg/m","mpl_vvegr",10,10,null,"Massi víravegriðs á lengdarmetra","Algeng þyngd víravegriða, t.d. Brifen og Blue systems"]
[null,"Steypt vegrið, steypa á lengdarmetra","m3/m","Vpl_stevegr",0.4,0.4,null,"Rúmmál steypts vegriðs á lengdarmetra","Stöðluð vegriðsútfærsla, DeltaBloc"]
[]
[null,"Handrið á brú","kg/m","mpL_handr",{"$f":"IF(G83<>\"\",G83,F83)","v":40},40,null,"Massi handriðs á brú á lengdarmetra","Algeng þyngd handriða á göngubrú"]
[]
[null,"Rafstrengur, lágspenna (1 kV)","kg/m","mpL_rafstr_1kv",4.22,4.22,null,"Massi lágspennurafstrengs á lengdarmetra","EPD S-P-06859 "]
[null,"Rafstrengur, háspenna (24 kV)","kg/m","mpL_rafstr_24kv",4.6399999999999997,4.6399999999999997,null,"Massi háspennurafstrengs á lengdarmetra","EPD S-P-06943"]
[]
[null,"Stál í þenslurauf","kg/m","mpL_stal_rauf",30,30,null,"Massi stáls í þenslurauf á lengdarmetra","Miðað við Transflex frá Trelleborg"]
[null,"Gúmmí í þenslurauf","kg/m","mpL_gummi_rauf",120,120,null,"Massi gúmmís í þenslurauf á lengdarmetra","Miðað við Transflex frá Trelleborg"]
[null,"Stykkjaþyngdir"]
[null,"Brunnur, D = 600 mm","kg/stk","mpst_Br_06",27.3,27.3,null,"Massi brunns, þvermál 600 mm","Vörubæklingur SET, Fráveitur, meðaltal 600 mm brunna"]
[null,"Brunnur, D = 1000 mm","kg/stk","mpst_Br_10",74.5,74.5,null,"Massi brunns, þvermál 1000 mm","Vörubæklingur SET, Fráveitur, meðaltal 1000 mm brunna"]
[null,"Steyptur flotkarmur fyrir brunn","kg/stk","mpst_flotk",120,120,null,"Massi steypts flotkarms fyrir brunn","Vörubæklingur SET, Fráveitur"]
[null,"Stállok fyrir brunn","kg/stk","mpst_br_lok",48,48,null,"Massi stálloks fyrir brunn","Vörubæklingur SET, Fráveitur"]
[null,"Niðurfall","kg/stk","mpst_nfall",10.5,10.5,null,"Massi niðurfalls úr PP","SET"]
[]
[null,"Ljósastaur, 4 m, galvaníserað stál","kg/stk","mpst_ljos_4",50,50,null,"Massi 4 m ljósastaurs úr galvaníseruðu stáli","Áætluð meðalþyngd"]
[null,"Ljósastaur, 5 m, galvaníserað stál","kg/stk","mpst_ljos_5",70,70,null,"Massi 5 m ljósastaurs úr galvaníseruðu stáli","Áætluð meðalþyngd"]
[null,"Ljósastaur, 6,3 m, galvaníserað stál","kg/stk","mpst_ljos_6",90,90,null,"Massi 6,3 m ljósastaurs úr galvaníseruðu stáli","Áætluð meðalþyngd"]
[null,"Ljósastaur, 8 m, galvaníserað stál","kg/stk","mpst_ljos_8",100,100,null,"Massi 8 m ljósastaurs úr galvaníseruðu stáli","Áætluð meðalþyngd"]
[null,"Ljósastaur, 10 m, galvaníserað stál","kg/stk","mpst_ljos_10",130,130,null,"Massi 10 m ljósastaurs úr galvaníseruðu stáli","Áætluð meðalþyngd"]
[null,"Ljósker","kg/stk","mpst_ljosker",7.5,7.5,null,"Massi ljóskers í ljósastaur","Meðaltal fjögurra tegunda ljóskera"]
[]
[null,"Bergboltar í göngum, 6,0 m, d = 32mm","kg/stk","mpst_bergb_6m",38.58,38.58,null,"Stykkaþyngd bergbolta í göngum, 6,0 m, d = 32mm","VegLCA"]
[null,"Bergboltar í göngum, 4,0 m, d = 20mm","kg/stk","mpst_bergb_4m",9.8800000000000008,9.8800000000000008,null,"Stykkjaþyngd bergbolta í göngum, 4,0 m, d = 20mm","VegLCA"]
[null,"Bergboltar í brú","kg/stk","mpst_bergb_bru",12,12,null,"Stykkjaþyngd bergbolta í brú","VegLCA"]
[null,"Legur, lóðrétt álag <300 tonn","kg/stk","mpst_legur_S",75,75,null,"Stykkjaþyngd legu, lóðrétt álag <300 tonn","Áætluð meðalþyngd"]
[null,"Legur, lóðrétt álag >300 tonn","kg/stk","mpst_legur_L",150,150,null,"Stykkjaþyngd legu, lóðrétt álag >300 tonn","Áætluð meðalþyngd"]
[null,"Þykktir"]
[null,"Malbik","m","d_malb",0.05,0.05,null,"Þykkt malbikslags","Algeng þykkt"]
[null,"Steyptar gangstéttar","m","d_gangs",0.1,0.1,null,"Þykkt steyptrar gangstéttar","Algeng þykkt"]
[null,"Jarðefnislag á eyjum og hringtorgum","m","d_eyja",0.3,0.3,null,"Þykkt jarðefnislags á eyjum og hringtorgum","Algeng þykkt"]
[null,"Steypumót","m","d_mot",0.15,0.15,null,"Þykkt steypumóta","VegLCA"]
[null,"Olíu- og rafmagnsnotkun við framkvæmdir"]
[null,"Olíunotkun, borun","L/m3 fast berg","Oil_bor",0.1,0.1,null,"Olíunotkun við að bora fyrir sprengingu á 1 m3 af föstu bergi","Íslenskar reynslutölur, Ístak"]
[null,"Olíunotkun, gröfuvinna","L/m3","Oil_grafa",0.26,0.26,null,"Olíunotkun við gröfuvinnu","VegLCA (Gravemaskin)"]
[null,"Olíunotkun, jarðýta","L/m3","Oil_yta",0.09,0.09,null,"Olíunotkun við jarðýtuvinnu","VegLCA (Hjullaster)"]
[null,"Olíunotkun, jarðvinna í vegstæði","L/m3","Oil_veg",1,1,null,"Olíunotkun við jarðvinnu í vegstæði","VegLCA (utgraving og planering)"]
[null,"Olíunotkun, jarðvinna í göngum","L/m3","Oil_gong",1.1000000000000001,1.1000000000000001,null,"Olíunotkun við gangnagröft","VegLCA"]
[null,"Olíunotkun, þjöppun","L/m3","Oil_valt",0.08,0.08,null,"Olíunotkun við völtun. G.r.f. að valta þurfi 6 umferðir í 50 cm lögum","Íslenskar reynslutölur, Ístak, Vegagerðin, Skútaberg"]
[null,"Olíunotkun, vinnsla","L/m3","Oil_vin",1.4,1.4,null,"Olíunotkun við vinnslu jarðefna","Íslenskar reynslutölur, Ístak"]
[null,"Olíunotkun, vinnsla (meiri)","L/m3","Oil_vinm",2,2,null,"Olíunotkun við meiri vinnslu jarðefna","Íslenskar reynslutölur, Ístak, Vegagerðin, Skútaberg"]
[null,"Olíunotkun, grjótvarnir","L/m3","Oil_grjot",0.19,0.19,null,"Olíunotkun við gerð grjótvarna","EFLA"]
[null,"Olíunotkun, útlögn malbiks","L/kg","oil_malb",8.0000000000000004E-4,8.0000000000000004E-4,null,"Olíunotkun við útlögn 1 kg malbiks","VegLCA"]
[null,"Olíunotkun, útlögn klæðingar","L/m2","oil_klaed",3.7037037037037035E-2,{"$f":"0.12/3.24","v":3.7037037037037035E-2},null,"Olíunotkun við útlögn klæðingar","Íslenskar reynslutölur, Borgarverk"]
[null,"Olíunotkun, borun könnunar og bergþéttingarhola","L/m","Oil_borun",0.6,0.6,null,"Olíunotkun við borun könnunar- og bergþéttingarhola","VegLCA"]
[null,"Rafmagnsnotkun við gangnagerð","kWh/m3","EpV_gong",6.6,6.6,null,"Rafmagnsnotkun við gangnagerð","VegLCA"]
[null,"Þjöppunarstuðlar"]
[null,"Þjöppunarstuðull laust/fast","m3 laust/m3 fast","CF_l_f",1.6,1.6,null,"Rúmmál af lausu bergi í 1 m3 af föstu bergi","Íslensk viðmið"]
[null,"Þjöppunarstuðull þjappað/fast","m3 þjappað/m3 fast","CF_þ_f",1.4,1.4,null,"Rúmmál af þjöppuðu bergi í 1 m3 af föstu bergi","Íslensk viðmið"]
[null,"Þjöppunarstuðull laust/þjappað","m3 laust/m3 þjappað","CF_l_þ",1.142857142857143,{"$f":"F129/F130","v":1.142857142857143},null,"Rúmmál af lausu bergi í 1 m3 af þjöppuðu bergi","Íslensk viðmið"]
[null,"Notkun sprengiefnis"]
[null,"Sprengiefni við námugröft","kg/m3","spr_fb",0.5,0.5,null,"Magn sprengiefnis til að sprengja 1 m3 af föstu bergi","Íslenskar reynslutölur, Ístak"]
[null,"Sprengiefni við gangnagerð","kg/m3","spr_gong",2,2,null,"Magn sprengiefnis til að sprengja 1 m3 af föstu bergi í göngum","VegLCA"]

{"sheet":"Reiknistuðlar - endurnýjun","index":13,"n_rows":22,"n_cols":7,"rows_kept":22,"cut":false,"hidden":false,"merged":[[1,3,1,5]]}
[]
[null,null,null,"Áætlaður endingartími [ár]"]
[null,null,"Tákn","Notað gildi","Sjálfgefið gildi","Yfirskrifað gildi","Fjöldi endurnýjana á líftíma"]
[null,"Óbundið burðarlag","ET_bur_ob",{"$f":"IF(F4<>\"\",F4,E4)","v":25},25,null,{"$f":"_xlfn.CEILING.MATH(Forsíða!$D$8/ET_bur_ob)-1","v":2}]
[null,"Klæðing, nýlögn","ET_klaeding",7,7,null,{"$f":"_xlfn.CEILING.MATH(Forsíða!$D$8/ET_klaeding)-1","v":8}]
[null,"Burðarlagsmalbik","ET_malb_bur",30,30,null,{"$f":"_xlfn.CEILING.MATH(Forsíða!$D$8/ET_malb_bur)-1","v":1}]
[null,"Slitlagsmalbik, ÁDU > 15000 ","ET_malb_15",10,10,null,{"$f":"_xlfn.CEILING.MATH(Forsíða!$D$8/ET_malb_15)-1","v":5}]
[null,"Slitlagsmalbik, ÁDU 3000 - 15000 ","ET_malb_3-15",10,10,null,{"$f":"_xlfn.CEILING.MATH(Forsíða!$D$8/ET_malb_3_15)-1","v":5}]
[null,"Slitlagsmalbik, ÁDU < 3000 og hjóla-/göngustígar","ET_malb_3",10,10,null,{"$f":"_xlfn.CEILING.MATH(Forsíða!$D$8/ET_malb_3)-1","v":5}]
[null,"Steypt gangstétt","ET_gangst_steypa",50,50,null,{"$f":"_xlfn.CEILING.MATH(Forsíða!$D$8/ET_gangst_steypa)-1","v":1}]
[null,"Gangstígar með hellum","ET_gangst_hellur",40,40,null,{"$f":"_xlfn.CEILING.MATH(Forsíða!$D$8/ET_gangst_hellur)-1","v":1}]
[null,"Kantsteinn","ET_kantst",50,50,null,{"$f":"_xlfn.CEILING.MATH(Forsíða!$D$8/ET_kantst)-1","v":1}]
[null,"Bitavegrið","ET_bvegr",30,30,null,{"$f":"_xlfn.CEILING.MATH(Forsíða!$D$8/ET_bvegr)-1","v":1}]
[null,"Röravegrið","ET_rvegr",30,30,null,{"$f":"_xlfn.CEILING.MATH(Forsíða!$D$8/ET_rvegr)-1","v":1}]
[null,"Víravegrið","ET_vvegr",30,30,null,{"$f":"_xlfn.CEILING.MATH(Forsíða!$D$8/ET_vvegr)-1","v":1}]
[null,"Ljósastaur","ET_ljstaur",30,30,null,{"$f":"_xlfn.CEILING.MATH(Forsíða!$D$8/ET_ljstaur)-1","v":1}]
[null,"Ljósker","ET_ljosker",25,25,null,{"$f":"_xlfn.CEILING.MATH(Forsíða!$D$8/ET_ljosker)-1","v":2}]
[null,"Vegrið á brú","ET_vegr_bru",50,50,null,{"$f":"_xlfn.CEILING.MATH(Forsíða!$D$8/ET_vegr_bru)-1","v":1}]
[null,"Legur","ET_legur",30,30,null,{"$f":"_xlfn.CEILING.MATH(Forsíða!$D$8/ET_legur)-1","v":1}]
[null,"Þensluraufar","ET_thraufar",30,30,null,{"$f":"_xlfn.CEILING.MATH(Forsíða!$D$8/ET_thraufar)-1","v":1}]
[]
[null,"Steypa magn endurnýjunar"]

{"sheet":"Losunarstuðlar","index":14,"n_rows":73,"n_cols":10,"rows_kept":73,"cut":false,"hidden":false,"merged":[[1,8,1,9]]}
[]
[null,null,"Eining","Tákn","Notað gildi\nkg CO2/eining","Sjálfgefið gildi\nkg CO2/eining","Yfirskrifað gildi\nkg CO2/eining","Lýsing","Heimild"]
[null,"Steypa"]
[null,"Steypa fyrir rör","m3","EF_St_ror",{"$f":"IF(G4<>\"\",G4,F4)","v":358},358,null,"Losunarstuðull framleiðslu (A1-A3) steypu í steypt rör","Sama og Steypa C30/37"]
[null,"Steypa, C30/37","m3","EF_st_30",358,358,null,"Losunarstuðull framleiðslu (A1-A3) steypu C30/37","Viðmiðunargildi í byggingarreglugerð"]
[null,"Steypa, C35/45","m3","EF_st_35",371,371,null,"Losunarstuðull framleiðslu (A1-A3) steypu C35/45","Viðmiðunargildi í byggingarreglugerð"]
[null,"Steypa, C45/55","m3","EF_st_45",426,426,null,"Losunarstuðull framleiðslu (A1-A3) steypu C45/55","\tMD-20014-DA_rev1"]
[null,"Steypa, C35/45, kantsteinn","m3","EF_st_35_kant",371,371,null,"Losunarstuðull framleiðslu (A1-A3) steypu C35/45 fyrir kantstein","Viðmiðunargildi í byggingarreglugerð"]
[null,"Steypa, C35/45, gangstétt","m3","EF_st_35_gang",371,371,null,"Losunarstuðull framleiðslu (A1-A3) steypu C35/45 fyrir gangstéttar","Viðmiðunargildi í byggingarreglugerð"]
[null,"Steypa, C35/45, steypt vegrið","m3","EF_st_35_vegr",371,371,null,"Losunarstuðull framleiðslu (A1-A3) steypu C35/45 fyrir steypt vegrið","Viðmiðunargildi í byggingarreglugerð"]
[null,"Sement, CEM1","kg","EF_cem1",0.81,0.81,null,"Losunarstuðull framleiðslu (A1-A3) sements","VegLCA","Gjennomsnitt av publiserte EPDer for sement, CEM I"]
[null,"Sprautusteypa með stáltrefjum (c30/37)","m3","EF_spr_st",358,358,null,"Losunarstuðull framleiðslu (A1-A3) sprautusteypu með stáltrefjum","Sama og Steypa C30/37"]
[null,"Hellur","kg","EF_hellur",8.4360000000000004E-2,8.4360000000000004E-2,null,"Losunarstuðull framleiðslu (A1-A3) hellna","NEPD-3330-1968-NO"]
[]
[null,"Stál"]
[null,"Stálrör","kg","EF_Stal_ror",{"$f":"IF(G16<>\"\",G16,F16)","v":2.2599999999999998},2.2599999999999998,null,"Losunarstuðull framleiðslu (A1-A3) stáls í stálrör (ræsi)","EPD","https://cspi.ca/sites/default/files/download/cspiSCS_EPD_100.pdf"]
[null,"Byggingastál í brú","kg","EF_St_bru",2.5099999999999998,2.5099999999999998,null,"Losunarstuðull framleiðslu (A1-A3) stáls notað við byggingu brúar","VegLCA","Meðaltal 11 EPD gefin út hjá EPD-Norge árið 2021"]
[null,"Ryðfrítt byggingastál í brú","kg","EF_St_bru_rf",3.49,3.49,null,"Losunarstuðull framleiðslu (A1-A3) ryðfrís stáls notað við byggingu brúar","VegLCA","Meðaltal NEPD-1621-644, NEPD-2524-1264, NEPD-2523-1266 og NEPD-1620-644"]
[null,"Kambstál","kg","EF_kamb",0.69,0.69,null,"Losunarstuðull framleiðslu (A1-A3) kambstáls","EPD","https://www.itb.pl/wp-content/uploads/2023/07/EPD_180_thyssenkrupp_2021.pdf"]
[null,"Eftirspennt járnalögn","kg","EF_eft_jarn",1.23,1.23,null,"Losunarstuðull framleiðslu (A1-A3) eftirspenntrar járnalagnar","EPD","Meðaltal tveggja EPD blaða: GlobalEPD 001-005 / S-P-02400"]
[null,"Galvaníserað stál f. vegrið","kg","EF_galvst_vegr",2.4,2.4,null,"Losunarstuðull framleiðslu (A1-A3) galvaníseraðs stáls f. vegrið","EPD","NEPD-5824-5105-NO"]
[null,"Galvaníserað stál f. ljósastaura","kg","EF_galvst_staur",3,3,null,"Losunarstuðull framleiðslu (A1-A3) galvaníseraðs stáls f. ljósastaura","EPD","NEPD-2711-1416-NO"]
[null,"Stál í víravegrið","kg","EF_stal_vvegr",2.5,2.5,null,"Losunarstuðull framleiðslu (A1-A3) stáls í víravegrið","https://en.bluesystems.se/products/safety-barriers/"]
[null,"Bergboltar úr kambstáli","kg","EF_bergb",0.86599999999999999,0.86599999999999999,null,"Losnuarstuðull framleiðslu (A1-A3) bergbolta úr kambstáli","VegLCA","Meðaltal 12 EPD gefin út hjá EPD-Norge árið 2021"]
[null,"Stállok á brunn","kg","EF_stallok",1.55,1.55,null,"Losunarstuðull framleiðslu (A1-A3) stáls í stállok á brunn","VegLCA (Støpejern)"]
[null,"Stálþil","kg","EF_stalthil",1.0669999999999999,1.0669999999999999,null,"Losunarstuðull framleiðslu (A1-A3) stálþilja","Meðaltal fjögurra EPD frá Arcelor mittal"]
[]
[null,"Veitur"]
[null,"Plast, PP","kg","EF_PP",{"$f":"IF(G29<>\"\",G29,F29)","v":2.5499999999999998},2.5499999999999998,null,"Losunarstuðull framleiðslu (A1-A3) Polypropylene plasts (í rör)","VegLCA","Inkluderer materialforbruk og ekstrudering av rør. Basert på ecoinvent-prosesser \"Polypropylene, granualte {GLO} og \"Extrusion, plastic pipes {RER}\""]
[null,"X-Stream rör fyrir fráveitu","kg","EF_FV_Xstr",2.41,2.41,null,"Losunarstuðull framleiðslu (A1-A3) á X-Stream fráveituröri","EPD","https://www.epd-norge.no/getfile.php/1325320-1668446058/EPDer/Byggevarer/R%C3%B8rsystemer/NEPD-3588-2251_X-Stream.pdf"]
[null,"Weholite rör fyrir fráveitu","kg","EF_FV_Weh",2.14,2.14,null,"Losunarstuðull framleiðslu (A1-A3) á Weholite fráveituröri","EPD","https://brandportal.uponor.com/m/7ca9f1765b079b32/original/EPD_Weholite_Poland_EPDHub.pdf"]
[null,"Plast, PE, í vatnsveiturör","kg","EF_VV_PE",2.58,2.58,null,"Losunarstuðull framleiðslu (A1-A3) á PE vatnsveituröri","VegLCA","Inkluderer materialforbruk og ekstrudering av rør. Basert på ecoinvent-prosesser \"Polyethylene, HDPE, granualte {GLO} og \"Extrusion, plastic pipes {RER}\""]
[null,"Hitaveiturör, D = 250 mm","m","EF_Hvror_025",156.18,156.18,null,"Losunarstuðull framleiðslu (A1-A3) á einangruðu stálröri, d = 250 mm","EPD","https://api.environdec.com/api/v1/EPDLibrary/Files/5521236b-1f29-46c6-cf01-08daa1eb7336/Data"]
[null,"Hitaveiturör, D = 300 mm","m","EF_Hvror_03",173.49,173.49,null,"Losunarstuðull framleiðslu (A1-A3) á einangruðu stálröri, d = 300 mm","EPD","https://api.environdec.com/api/v1/EPDLibrary/Files/5521236b-1f29-46c6-cf01-08daa1eb7336/Data"]
[null,"Hitaveiturör, D = 350 mm","m","EF_Hvror_035",207.25,207.25,null,"Losunarstuðull framleiðslu (A1-A3) á einangruðu stálröri, d = 350 mm","EPD","https://api.environdec.com/api/v1/EPDLibrary/Files/5521236b-1f29-46c6-cf01-08daa1eb7336/Data"]
[null,"Hitaveiturör, D = 400 mm","m","EF_Hvror_04",233.34,233.34,null,"Losunarstuðull framleiðslu (A1-A3) á einangruðu stálröri, d = 400 mm","EPD","https://api.environdec.com/api/v1/EPDLibrary/Files/5521236b-1f29-46c6-cf01-08daa1eb7336/Data"]
[null,"Hitaveiturör, D = 450 mm","m","EF_Hvror_045",330.48,330.48,null,"Losunarstuðull framleiðslu (A1-A3) á einangruðu stálröri, d = 450 mm","EPD","https://api.environdec.com/api/v1/EPDLibrary/Files/5521236b-1f29-46c6-cf01-08daa1eb7336/Data"]
[null,"Hitaveiturör, D = 500 mm","m","EF_Hvror_05",390.4,390.4,null,"Losunarstuðull framleiðslu (A1-A3) á einangruðu stálröri, d = 500 mm","EPD","https://api.environdec.com/api/v1/EPDLibrary/Files/5521236b-1f29-46c6-cf01-08daa1eb7336/Data"]
[null,"Hitaveiturör, D = 600 mm","m","EF_Hvror_06",497.19,497.19,null,"Losunarstuðull framleiðslu (A1-A3) á einangruðu stálröri, d = 600 mm","EPD","https://api.environdec.com/api/v1/EPDLibrary/Files/5521236b-1f29-46c6-cf01-08daa1eb7336/Data"]
[null,"Hitaveiturör, D = 700 mm","m","EF_Hvror_07",600.83000000000004,600.83000000000004,null,"Losunarstuðull framleiðslu (A1-A3) á einangruðu stálröri, d = 700 mm","EPD","https://api.environdec.com/api/v1/EPDLibrary/Files/5521236b-1f29-46c6-cf01-08daa1eb7336/Data"]
[null,"Hitaveiturör, D = 800 mm","m","EF_Hvror_08",742.76,742.76,null,"Losunarstuðull framleiðslu (A1-A3) á einangruðu stálröri, d = 800 mm","EPD","https://api.environdec.com/api/v1/EPDLibrary/Files/5521236b-1f29-46c6-cf01-08daa1eb7336/Data"]
[null,"Ljósleiðari","m","EF_ljosleid",2,2,null,"Losunarstuðull framleiðslu (A1-A3) ljósleiðara á lengdarmetra","EPD","https://api.environdec.com/api/v1/EPDLibrary/Files/3fd1b7a0-9384-4fb1-afcf-70a2bea38530/Data "]
[null,"Rafstrengur, lágspenna (1 kV)","m","EF_strengur_1kv",71.7,71.7,null,"Losunarstuðull framleiðslu (A1-A3) 1 kV rafstrengs á lengdarmetra","EPD","https://api.environdec.com/api/v1/EPDLibrary/Files/d52e494d-c664-4a77-72d1-08da954a8add/Data"]
[null,"Rafstrengur, háspenna (24 kV)","m","EF_strengur_24kv",53.5,53.5,null,"Losunarstuðull framleiðslu (A1-A3) 24 kV rafstrengs á lengdarmetra","EPD","https://api.environdec.com/api/v1/EPDLibrary/Files/ebc7cfbb-4014-4f8d-72d2-08da954a8add/Data"]
[]
[null,"Flutningur og orkunotkun"]
[null,"Massaflutningur innanlands","tkm","EF_fl_mi",{"$f":"IF(G47<>\"\",G47,F47)","v":0.248},0.248,null,"Losunarstuðull massaflutnings (A4) innanlands","VegLCA"]
[null,"Gámaflutningur innanlands","tkm","EF_fl_i",{"$f":"IF(G48<>\"\",G48,F48)","v":0.16400000000000001},0.16400000000000001,null,"Losunarstuðull flutnings (A4) í gámabíl innanlands","VegLCA"]
[null,"Flutningur á sjó","tkm","EF_fl_s",{"$f":"IF(G49<>\"\",G49,F49)","v":2.8000000000000001E-2},2.8000000000000001E-2,null,"Losunarstuðull flutnings (A4) á sjó","Kolefnisreiknivél Eimskips"]
[null,"Olíunotkun","L","EF_oil",{"$f":"IF(G50<>\"\",G50,F50)","v":3.24},3.24,null,"Losunarstuðull brennslu dísilolíu (A5) í vinnuvélum","VegLCA"]
[null,"Rafmagnsnotkun","kWh","EF_rafm",{"$f":"IF(G51<>\"\",G51,F51)","v":1.03E-2},1.03E-2,null,"Losunarstuðull framleiðslu og dreifingu (A1-A3) rafmagns (","UST"]
[]
[null,"Malbik og slitlög"]
[null,"Slitlagsmalbik, umferð > 15000 ÁDU","kg","EF_malb_15",{"$f":"IF(G54<>\"\",G54,F54)","v":8.9200000000000002E-2},{"$f":"89.2/1000","v":8.9200000000000002E-2},null,"Losunarstuðull framleiðslu (A1-A3) slitlagsmalbiks, ÁDU > 15000","EFLA 2023"]
[null,"Slitlagsmalbik, umferð 3000 - 15000 ÁDU","kg","EF_malb_3-15",{"$f":"IF(G55<>\"\",G55,F55)","v":4.8500000000000001E-2},4.8500000000000001E-2,null,"Losunarstuðull framleiðslu (A1-A3) slitlagsmalbiks, ÁDU 3000 - 8000","EFLA 2023"]
[null,"Slitlagsmalbik, umferð < 3000 ÁDU","kg","EF_malb_3",{"$f":"IF(G56<>\"\",G56,F56)","v":4.6100000000000002E-2},4.6100000000000002E-2,null,"Losunarstuðull framleiðslu (A1-A3) slitlagsmalbiks, ÁDU < 3000","EFLA 2023"]
[null,"Burðarlagsmalbik","kg","EF_malb_bur",{"$f":"IF(G57<>\"\",G57,F57)","v":1.2500000000000001E-2},1.2500000000000001E-2,null,"Losunarstuðull framleiðslu (A1-A3) burðarlagsmalbiks","EFLA 2023"]
[null,"Klæðing","m2","EF_klaed",{"$f":"IF(G58<>\"\",G58,F58)","v":2.35},2.35,null,"Losunarstuðull öflunar hráefna (A1-A3) í klæðingar","EFLA 2013"]
[]
[null,"Annað"]
[null,"Sprengiefni","kg","EF_spr",{"$f":"IF(G61<>\"\",G61,F61)","v":1.26},1.26,null,"Losunarstuðull framleiðslu (A1-A3) á sprengiefni","VegLCA","Meðaltal 10 EPD frá norska markaðnum"]
[null,"Trefjadúkur","m2","EF_duk",{"$f":"IF(G62<>\"\",G62,F62)","v":0.53100000000000003},0.53100000000000003,null,"Losunarstuðull framleiðslu (A1-A3) trefjadúks","VegLCA"]
[null,"Ljósker","stk","EF_ljosker",{"$f":"IF(G63<>\"\",G63,F63)","v":60},60,null,"Losunarstuðull framleiðslu (A1-A3) ljóskera í ljósastuarum","Miðgildi fimm tegunda ljóskera"]
[null,"Grjótvörn","m3","EF_grjot",3.08,3.08,null,"Losunarstuðull öflunar (A1-A3) grjóts í grjótvarnir","EFLA"]
[null,"Byggingatimbur","m3","EF_timbur",76.599999999999994,76.599999999999994,null,"Losunarstuðull framleiðslu (A1-A3) byggingatimburs","NEPD-2547-1284-NO"]
[null,"Vatnsvarnarlag undir malbik","m2","EF_vatnsv",12,12,null,"Losunarstuðull framleiðslu (A1-A3) vatnsvarnarlags","Carbon Calculation guide for bridges"]
[null,"Legur, lóðrétt álag <300 tonn","stk","EF_legur_s",10000,10000,null,"Losunarstuðull framleiðslu (A1-A3) lega í brýr, lóðrétt álag <300 tonn","Carbon calculator guide for bridges"]
[null,"Legur, lóðrétt álag >300 tonn","stk","EF_legur_L",20000,20000,null,"Losunarstuðull framleiðslu (A1-A3) lega í brýr, lóðrétt álag >300 tonn","Carbon Calculation guide for bridges"]
[null,"Gúmmí í þensluraufar og legur","kg","EF_gummi",4.49,4.49,null,"Losunarstuðull framleiðslu (A1-A3) gúmmís fyrir þensluraufar og legur","Carbon calculator guide for bridges"]
[null,"Einangrunarklæðing undir sprautusteypu","kg","EF_einangrun",9.2899999999999991,9.2899999999999991,null,"Losunarstuðull framleiðslu (A1-A3) einangrunarklæðingar","EPD"]
[null,"Einangrunarklæðing undir sprautusteypu, A5","kg","EF_einangrun_a5",0.88,0.88,null,"Losunarstuðull uppsetningar (A5) einangrunarklæðingar","EPD"]
[null,"Dúkur undir sprautusteypu","kg","EF_dukur",3.19,3.19,null,"Losunarstuðull framleiðslu (A1-A3) dúks undir sprautusteypu","EPD"]
[null,"Dúkur undir sprautusteypu, A5","kg","EF_dukur_a5",0.19900000000000001,0.19900000000000001,null,"Losunarstuðull uppsetningar (A5) dúks undir sprautusteypu","EPD"]

{"sheet":"Útgáfusaga","index":15,"n_rows":5,"n_cols":5,"rows_kept":5,"cut":false,"hidden":false,"merged":[]}
[]
[null,"Útgáfa","Dags","Skýring","Unnið af"]
[null,"V0.1 Beta","04.03.2024","Beta útgáfa til prófunar hjá Vegagerðinni","Björgvin Brynjarsson (EFLA Verkfræðistofa)\nMagnús Arason (EFLA Verkfræðistofa)"]
[null,"V1.0","04.06.2024","Fyrsta útgáfa","Björgvin Brynjarsson (EFLA Verkfræðistofa)\nMagnús Arason (EFLA Verkfræðistofa)"]
[null,"V1.01","2024-09-16","Útgáfa 1.01, útreikningar fyrir steypu leiðréttir","Björgvin Brynjarsson (EFLA Verkfræðistofa)\nMagnús Arason (EFLA Verkfræðistofa)"]

{"sheet":"Sheet2","index":16,"n_rows":7,"n_cols":18,"rows_kept":7,"cut":false,"hidden":true,"merged":[]}
[]
[null,"Veldu þykkt",null,null,"Veldu fjölda ljóskera",null,null,null,"Varanlegt",null,null,null,"Veldu tegund vegkafla",null,null,"Veldu framkvæmdarstig","óvissubil"]
[null,40,null,null,1,null,null,null,"Tímabundið (endurnotað)",null,null,null,"Vegur",null,null,"Frumdrög (óvissa frá -20% til +40%)",0.8,1.4]
[null,50,null,null,2,null,null,null,null,null,null,null,"Brú",null,null,"Forhönnun (óvissa frá -15% til +25%)",0.85,1.25]
[null,60,null,null,null,null,null,null,null,null,null,null,"Göng",null,null,"Verkhönnun (óvissa frá -10% til +15%)",0.9,1.1499999999999999]
[null,null,null,null,null,null,null,null,null,null,null,null,"Gönguleið",null,null,"Framkvæmd (óvissa frá -5% til +10%)",0.95,1.1000000000000001]
[null,null,null,null,null,null,null,null,null,null,null,null,null,null,null,"Framkvæmdum lokið (engin áætluð óvissa)",1,1]